program: Orca
programVersion: 5.0.2
elementType: S P O O O N C C C C C C C C C C C C C H H H H H H H H H H H H H H H H H H H H H H
charge: 0
multiplicity: 1
keywords: wb97x-d3
keywords: def2-TZVPP
keywords: def2/J RIJCOSX
keywords: DEFGRID2
keywords: scfconv7
keywords: smallprint printgap noloewdin
keywords: NOSOSCF
formula: C13H22NO3PS
InChI: InChI=1/C13H22NO3PS/c1-6-16-18(15,14-10(2)3)17-12-7-8-13(19-5)11(4)9-12/h7-10,14H,6H2,1-5H3
41 atoms
S  -5.027929 0.624114 0.146192
P  1.878786 -0.028334 0.21073
O  0.672094 -0.808634 -0.552203
O  1.808545 1.373028 -0.54961
O  1.721778 0.024889 1.685324
N  3.249087 -0.767443 -0.29581
C  3.826107 -1.924889 0.398796
C  5.29718 -2.024621 0.032815
C  3.085451 -3.217819 0.088763
C  -0.648293 -0.455468 -0.337706
C  -2.660213 0.589742 -1.164376
C  -1.317472 0.267557 -1.313007
C  2.315976 2.585484 0.041016
C  -1.303029 -0.861854 0.80973
C  -3.327164 0.18326 0.003895
C  -2.642613 -0.540863 0.97477
C  -3.37598 1.355713 -2.23423
C  3.823193 2.619886 0.121124
C  -5.488423 -0.000193 1.771058
H  3.751458 -1.724139 1.468931
H  3.424494 -0.757527 -1.294474
H  5.834228 -1.111978 0.291264
H  5.764752 -2.85345 0.564115
H  5.423118 -2.203084 -1.037562
H  3.101008 -3.428182 -0.982591
H  2.044577 -3.173774 0.411095
H  3.552401 -4.05965 0.601478
H  -0.792935 0.575054 -2.209806
H  1.948387 3.382321 -0.6030
H  1.869825 2.725917 1.02719
H  -0.789535 -1.442552 1.564443
H  -3.139101 -0.871088 1.876173
H  -3.769081 2.302874 -1.857974
H  -2.712475 1.579616 -3.067617
H  -4.225241 0.793526 -2.629553
H  4.133309 3.610284 0.454876
H  4.216575 1.895309 0.833841
H  4.280566 2.436479 -0.851213
H  -6.528074 0.287922 1.919466
H  -4.892711 0.450515 2.563113
H  -5.4228 -1.085243 1.828182
elementType: S P O N C H
totalener: -1528.84469653 hartree
nucrepener: 1809.29350951 hartree
electener: -3338.13820604 hartree
oneelecener: -5695.52306693 hartree
twoeener: 2357.38486089 hartree
cpcmener: -0.03616909 hartree
kineticenergy: 1523.70803132 hartree
xcener: -113.004714270404 hartree
chargesum: -0.0000000
charge: -0.075920 0.900723 -0.391382 -0.379933 -0.671878 -0.261067 0.116064 -0.268791 -0.271673 0.275591 0.036390 -0.204127 0.040289 -0.238558 -0.038657 -0.157723 -0.226546 -0.251673 -0.274085 0.065155 0.157290 0.093201 0.088782 0.090331 0.087614 0.086123 0.091116 0.134206 0.104727 0.095000 0.150101 0.150427 0.101323 0.096406 0.100668 0.100796 0.084311 0.087695 0.133844 0.122247 0.121593
qa: -0.0759 0.9007 -0.3914 -0.3799 -0.6719 -0.2611 0.1161 -0.2688 -0.2717 0.2756 0.0364 -0.2041 0.0403 -0.2386 -0.0387 -0.1577 -0.2265 -0.2517 -0.2741 0.0652 0.1573 0.0932 0.0888 0.0903 0.0876 0.0861 0.0911 0.1342 0.1047 0.0950 0.1501 0.1504 0.1013 0.0964 0.1007 0.1008 0.0843 0.0877 0.1338 0.1222 0.1216
va: 2.3835 5.5052 2.0718 2.0859 1.9118 3.1050 3.8554 3.9281 3.9216 3.6766 3.6757 4.0398 3.8587 4.0727 3.9419 3.8587 3.8880 3.9196 3.9881 1.0244 1.0267 1.0086 1.0052 1.0023 1.0063 1.0135 1.0088 1.0147 0.9902 1.0039 1.0100 0.9968 1.0013 1.0073 0.9995 1.0091 1.0107 1.0061 0.9992 0.9955 0.9947
dispcorr: -0.018354835 hartree
energy: -1528.863051361552
dipole: 14.69827 -13.94196 0.75631 -2.36453 2.37711 0.01258 0.13670 -0.98292 -0.84622
magnitude: 1.13501 au
magnitude: 2.88497 debye
