program: Orca
programVersion: 5.0.2
elementType: S P O O O N C C C C C C C C C C C C C H H H H H H H H H H H H H H H H H H H H H H
charge: 0
multiplicity: 1
keywords: wb97x-d3
keywords: def2-TZVPP
keywords: def2/J RIJCOSX
keywords: DEFGRID2
keywords: scfconv7
keywords: smallprint printgap noloewdin
keywords: NOSOSCF
formula: C13H22NO3PS
InChI: InChI=1/C13H22NO3PS/c1-6-16-18(15,14-10(2)3)17-12-7-8-13(19-5)11(4)9-12/h7-10,14H,6H2,1-5H3
41 atoms
S  -4.971196 0.986418 -0.32935
P  1.986152 0.129855 0.569359
O  0.690162 -0.698437 0.043256
O  2.277696 0.984624 -0.746943
O  1.747671 0.895534 1.815867
N  3.183282 -0.971124 0.680264
C  3.634859 -1.842422 -0.409415
C  3.063725 -3.244749 -0.264732
C  5.153907 -1.854466 -0.452395
C  -0.598795 -0.239857 -0.035296
C  -2.918891 -0.891128 -0.283795
C  -1.571797 -1.218413 -0.18625
C  3.304809 1.998041 -0.732498
C  -0.951875 1.100543 0.014875
C  -3.282057 0.461329 -0.201474
C  -2.296078 1.431202 -0.063958
C  -3.927967 -1.983314 -0.455807
C  2.725136 3.354379 -0.412923
C  -5.595618 0.554471 1.316924
H  3.271931 -1.413123 -1.345028
H  3.377773 -1.31882 1.611482
H  1.973757 -3.234541 -0.267715
H  3.394618 -3.880437 -1.086526
H  3.397187 -3.705151 0.66773
H  5.549973 -0.849578 -0.601465
H  5.509881 -2.482812 -1.26927
H  5.568198 -2.24989 0.477379
H  -1.268726 -2.257551 -0.23876
H  4.096532 1.73312 -0.027476
H  3.742875 1.985889 -1.729458
H  -0.221922 1.892426 0.108623
H  -2.579628 2.474135 -0.013059
H  -4.702279 -1.703644 -1.169458
H  -3.454122 -2.90104 -0.801325
H  -4.429975 -2.212321 0.486579
H  3.511884 4.105824 -0.480267
H  1.941449 3.628179 -1.119073
H  2.315064 3.39154 0.595654
H  -5.04682 1.083576 2.093274
H  -5.547668 -0.51739 1.497963
H  -6.639423 0.863477 1.354816
elementType: S P O N C H
totalener: -1528.84258702 hartree
nucrepener: 1806.09844343 hartree
electener: -3334.94103045 hartree
oneelecener: -5688.55725323 hartree
twoeener: 2353.61622279 hartree
cpcmener: -0.03545583 hartree
kineticenergy: 1523.71619370 hartree
xcener: -113.004239190440 hartree
chargesum: 0.0000000
charge: -0.143750 0.810567 -0.327145 -0.360105 -0.654075 -0.262089 0.117105 -0.274276 -0.268440 0.275001 0.025175 -0.191360 0.059872 -0.195515 -0.016526 -0.155600 -0.234803 -0.259508 -0.271301 0.072140 0.164576 0.089686 0.091223 0.089297 0.092203 0.090000 0.089302 0.139343 0.090527 0.105417 0.137684 0.128551 0.100011 0.101143 0.109603 0.104773 0.089047 0.081965 0.117683 0.117260 0.125339
qa: -0.1437 0.8106 -0.3271 -0.3601 -0.6541 -0.2621 0.1171 -0.2743 -0.2684 0.2750 0.0252 -0.1914 0.0599 -0.1955 -0.0165 -0.1556 -0.2348 -0.2595 -0.2713 0.0721 0.1646 0.0897 0.0912 0.0893 0.0922 0.0900 0.0893 0.1393 0.0905 0.1054 0.1377 0.1286 0.1000 0.1011 0.1096 0.1048 0.0890 0.0820 0.1177 0.1173 0.1253
va: 2.2215 5.5884 2.1225 2.0360 1.9317 3.1043 3.8266 3.9461 3.9396 3.7846 3.6846 3.9323 3.8332 3.9737 3.7356 4.0730 3.8774 3.9343 3.9662 1.0208 1.0205 1.0114 1.0062 1.0035 1.0063 1.0054 1.0038 1.0083 1.0061 0.9922 1.0073 1.0212 1.0140 1.0057 0.9898 1.0096 1.0027 1.0180 0.9992 0.9961 0.9988
dispcorr: -0.019235296 hartree
energy: -1528.861822317190
dipole: 11.56960 -10.09652 1.47308 -7.54567 6.20414 -1.34153 -2.11995 1.52169 -0.59827
magnitude: 2.08029 au
magnitude: 5.28768 debye
