program: Orca
programVersion: 5.0.2
elementType: S P O O O N C C C C C C C C C C C C C H H H H H H H H H H H H H H H H H H H H H H
charge: 0
multiplicity: 1
keywords: wb97x-d3
keywords: def2-TZVPP
keywords: def2/J RIJCOSX
keywords: DEFGRID2
keywords: scfconv7
keywords: smallprint printgap noloewdin
keywords: NOSOSCF
formula: C13H22NO3PS
InChI: InChI=1/C13H22NO3PS/c1-6-16-18(15,14-10(2)3)17-12-7-8-13(19-5)11(4)9-12/h7-10,14H,6H2,1-5H3
41 atoms
S  -4.593346 0.890849 -0.496104
P  2.098918 0.004425 0.794917
O  0.884481 -1.064248 0.606476
O  2.067396 0.742144 -0.622893
O  1.935489 0.896575 1.970939
N  3.461329 -0.899339 0.865573
C  3.866164 -2.055323 0.054499
C  3.575507 -1.87173 -1.424626
C  3.283238 -3.357355 0.585203
C  -0.395284 -0.587496 0.381059
C  -2.188853 -0.149049 -1.17175
C  -0.902821 -0.600444 -0.90842
C  2.059786 2.178724 -0.751077
C  -1.160184 -0.120227 1.4332
C  -2.969289 0.329455 -0.104925
C  -2.447707 0.33473 1.184792
C  -2.718559 -0.161273 -2.572385
C  0.651724 2.710539 -0.853817
C  -5.236373 1.461586 1.085493
H  4.951145 -2.104875 0.16671
H  3.843694 -0.926581 1.802717
H  2.506405 -1.869788 -1.643474
H  4.013865 -0.954179 -1.815566
H  4.012563 -2.704951 -1.974594
H  3.482697 -3.470272 1.651806
H  3.734231 -4.208304 0.073139
H  2.204905 -3.409985 0.433144
H  -0.290495 -0.967944 -1.723348
H  2.591846 2.639482 0.08248
H  2.623441 2.394508 -1.657774
H  -0.773126 -0.119835 2.443482
H  -3.031977 0.693732 2.020348
H  -1.981086 -0.560666 -3.266295
H  -3.620003 -0.772008 -2.659056
H  -2.981033 0.8439 -2.910296
H  0.688108 3.791085 -0.997239
H  0.121955 2.279537 -1.703484
H  0.077501 2.513413 0.052543
H  -4.646658 2.280737 1.493307
H  -5.309348 0.65639 1.814416
H  -6.240416 1.831456 0.883171
elementType: S P O N C H
totalener: -1528.84192951 hartree
nucrepener: 1862.48785639 hartree
electener: -3391.32978590 hartree
oneelecener: -5801.80428922 hartree
twoeener: 2410.47450332 hartree
cpcmener: -0.03479559 hartree
kineticenergy: 1523.69924016 hartree
xcener: -113.007158460589 hartree
chargesum: 0.0000000
charge: -0.074664 0.836665 -0.365581 -0.357203 -0.671738 -0.284400 0.127167 -0.278280 -0.283269 0.285539 0.044509 -0.221222 0.056680 -0.241310 -0.028998 -0.160192 -0.231304 -0.257349 -0.276784 0.070174 0.168254 0.083786 0.095750 0.100651 0.092764 0.093763 0.083059 0.142344 0.090261 0.101968 0.146066 0.149666 0.096016 0.104301 0.102218 0.108710 0.090037 0.081547 0.123281 0.122494 0.134625
qa: -0.0747 0.8367 -0.3656 -0.3572 -0.6717 -0.2844 0.1272 -0.2783 -0.2833 0.2855 0.0445 -0.2212 0.0567 -0.2413 -0.0290 -0.1602 -0.2313 -0.2573 -0.2768 0.0702 0.1683 0.0838 0.0957 0.1007 0.0928 0.0938 0.0831 0.1423 0.0903 0.1020 0.1461 0.1497 0.0960 0.1043 0.1022 0.1087 0.0900 0.0815 0.1233 0.1225 0.1346
va: 2.3849 5.5494 2.0366 2.0422 1.9246 3.1221 3.8661 3.9231 3.9295 3.6445 3.6194 3.9562 3.8443 4.0985 3.9287 3.8843 3.8894 3.9170 3.9875 1.0022 1.0175 1.0059 1.0121 1.0056 1.0083 1.0073 1.0114 1.0026 1.0089 0.9932 1.0137 0.9960 1.0077 0.9998 1.0009 1.0118 1.0010 1.0089 0.9953 0.9942 0.9988
dispcorr: -0.020960893 hartree
energy: -1528.862890402945
dipole: 4.25673 -3.95674 0.30000 -2.06832 1.71760 -0.35072 -8.14678 7.29807 -0.84871
magnitude: 0.96608 au
magnitude: 2.45559 debye
