program: Gaussian 09
title: 000065747
version: EM64L-G09RevD.01
frameworkgroup: C1[X(C22H28N2O5)]
method: RPBEPBE
basis: SDD
operation: Freq
keyword: #p
keyword: freq=noraman
keyword: PBEPBE/SDD
title: #p freq=noraman PBEPBE/SDD
converged: YES YES NO NO
title: Mulliken charges:
elementType: O O O O O N N C C C C C C C C C C C C C C C C C C C C C C H H H H H H H H H H H H H H H H H H H H H H H H H H H H
charge: -0.291523 -0.436603 -0.429188 -0.223398 -0.269690 -0.101712 -0.496722 -0.120629 -0.056905 -0.520443 -0.079007 -0.211942 -0.497799 -0.527173 -0.122343 -0.128407 0.155918 -0.379589 0.119203 -0.512223 0.098697 0.167824 0.240598 -0.517787 -0.417966 -0.553616 -0.379811 0.338798 -0.536396 0.239704 0.233087 0.184701 0.241119 0.223739 0.262583 0.215938 0.225338 0.240915 0.232732 0.253650 0.209351 0.214651 0.191578 0.226657 0.206097 0.299244 0.347570 0.215784 0.237692 0.214099 0.235285 0.376579 0.243239 0.243392 0.215249 0.216225 0.243639
chargesum: 0.00000
title: Mulliken charges with hydrogens summed into heavy atoms:
elementType: O O O O O N N C C C C C C C C C C C C C C C C C C C C C C
charge: -0.291523 -0.089033 -0.052610 -0.223398 -0.269690 -0.101712 -0.197478 0.119075 0.176182 -0.094622 0.144732 0.050641 -0.056523 -0.053527 0.131307 0.080944 0.155918 0.026639 0.119203 -0.079468 0.098697 0.167824 0.240598 0.149788 -0.182680 -0.310377 -0.136419 0.338798 0.138716
polarizability: 3.79617033e+02 1.62069762e+01 2.65577575e+02 3.02825444e-01 -7.34052226e+00 1.72797297e+02
1716.lowfreq: -6.9901 -0.0006 0.0005 0.0008 3.5265 8.4031 18.9032 24.0364 43.5742
frequency: 18.8064 23.8300 43.5625 52.4746 73.7220 75.2297 96.4643 99.5318 109.9615 133.5766 139.3606 151.8178 157.7908 175.8809 187.4647 193.2582 218.8112 234.4816 238.8905 243.1281 257.9312 269.2965 294.4454 312.6909 319.5459 327.9389 371.6989 373.7412 384.4162 392.3510 430.3393 440.3917 446.9532 461.2079 462.6260 469.4994 485.2304 487.3188 499.8375 514.2966 545.7504 557.2198 575.0411 578.1107 605.8371 621.6145 636.7823 650.2313 670.3703 691.5475 712.8623 738.5533 745.4074 755.8366 767.9447 804.0644 811.9150 820.8530 852.8057 871.5811 892.3733 907.8955 916.9552 926.2800 941.4513 946.3971 965.0141 984.0746 994.6362 1000.6055 1015.0922 1015.7449 1030.7860 1038.0933 1046.3313 1057.9498 1065.1478 1080.8550 1101.1829 1104.9815 1112.2964 1113.7411 1119.7553 1124.1099 1129.0782 1148.9574 1150.5436 1159.4604 1165.3888 1169.3529 1196.6707 1198.4481 1215.4289 1224.5815 1226.0872 1235.3548 1241.6213 1255.0422 1256.4366 1261.7849 1265.3789 1280.7042 1286.0574 1293.6383 1305.7538 1308.0746 1313.3810 1322.3158 1329.3733 1332.8999 1341.3643 1352.7241 1359.0449 1368.2841 1374.9143 1380.3115 1393.4671 1395.3701 1396.3530 1433.5143 1438.9744 1439.8470 1444.5097 1457.5045 1463.6350 1464.0906 1465.3003 1472.9322 1476.0842 1477.4681 1481.5896 1484.2901 1493.8671 1579.9514 1606.0602 1638.8030 1651.8157 2798.2231 2855.6788 2870.7276 2939.8329 2947.9279 2951.9382 2968.7783 2972.2100 2974.7293 2984.7192 2990.8060 2994.2800 3018.7208 3020.8051 3022.0638 3023.7668 3031.0068 3034.7816 3050.5531 3065.7924 3106.6339 3118.4554 3135.6174 3151.2266 3169.1498 3498.2477 3530.9674 3608.1931
redmass: 5.1257 4.9655 4.6105 5.4023 3.7279 9.6532 5.1428 3.1849 4.2901 3.9468 5.3280 3.6013 3.0927 3.4576 1.6436 3.8619 2.1355 2.9186 1.8340 2.3096 3.6089 2.4424 3.1645 3.9793 3.9583 3.3003 4.1264 3.9539 3.7124 4.6223 2.8257 4.1125 2.4080 1.5931 3.0224 3.7780 1.3474 2.2071 3.2452 4.1297 3.7130 3.4930 3.2444 3.6109 2.7115 3.5124 4.6244 2.5715 2.7068 3.9006 4.1050 2.8300 3.3610 4.0907 3.3430 3.7942 1.6416 1.7707 2.4835 2.8732 2.4660 3.7751 2.6310 3.5465 3.3115 1.3324 2.4642 2.9204 3.5829 3.5111 2.1969 3.6318 3.5035 2.7291 2.3077 2.8012 2.8130 2.9308 2.2227 2.2955 1.2616 2.0401 1.3370 2.7473 1.7680 1.4975 1.6202 2.0754 2.0643 1.9611 1.4635 1.2483 1.4146 1.4470 1.3289 1.4469 1.9794 1.3576 1.3200 1.3794 1.3961 1.5072 1.3408 1.6827 1.4324 1.4544 1.2215 1.3889 1.4180 1.3586 1.5928 1.3378 1.6581 1.8848 1.4828 1.5381 1.5165 4.2639 1.4759 1.2246 2.1831 1.1609 1.4182 1.1074 1.0507 1.0579 1.1065 1.2760 1.0849 1.0577 2.6181 1.1277 3.2296 7.9640 7.4868 7.0314 7.8404 1.0765 1.0707 1.0696 1.0334 1.0334 1.0824 1.0811 1.0599 1.0835 1.0730 1.0692 1.0702 1.1024 1.0985 1.0884 1.0870 1.1034 1.0900 1.1007 1.0993 1.0985 1.0984 1.0888 1.0911 1.0955 1.0639 1.0650 1.0801
irintensity: 0.1723 0.1260 0.9689 0.4977 3.4669 1.4502 0.3545 3.9341 0.2345 4.5902 0.7640 1.8854 1.5201 1.0906 2.7335 1.0500 1.2061 1.5352 1.4803 10.8762 8.5281 2.7584 4.3884 5.8945 3.7769 6.7483 2.9113 1.0299 1.0735 2.1408 5.2169 0.5439 22.5936 75.6618 9.0701 9.3527 117.0133 10.4362 13.5479 13.4266 9.3301 4.5231 20.7143 30.6954 39.4523 5.5840 0.2559 94.2438 80.2932 12.1047 12.5854 1.7455 1.7729 1.5653 0.8332 5.2546 8.1156 77.1851 25.0742 5.7720 0.8426 2.3567 7.3926 19.3802 8.6642 0.0393 19.9384 19.4101 37.4517 19.5631 3.2062 16.2261 54.1244 111.8943 36.5529 105.8720 118.6475 34.6259 20.8278 19.4270 0.2838 19.7766 1.2538 3.6456 4.1430 40.1615 8.5344 53.9474 149.0302 1.6986 12.0280 2.7697 30.6019 2.1254 3.9168 24.5900 0.7211 37.9702 3.1810 28.6853 17.3916 46.8925 5.9341 2.0994 10.6118 27.4476 16.2575 25.3527 5.4756 6.1771 79.3774 4.4894 15.6101 33.7334 19.8017 3.1378 4.1949 26.7890 2.0047 12.0076 3.6447 3.2385 10.6733 7.0259 12.2984 11.6557 13.1221 73.6720 11.4632 7.6402 19.3356 15.6276 39.8044 16.0319 5.7317 104.6094 131.1625 79.7344 55.9557 94.9571 58.4977 73.7769 14.9109 20.7084 42.7244 18.2260 17.8605 4.5189 73.0495 47.4564 27.3047 39.3099 2.3616 56.3773 65.4645 22.2440 33.4491 30.5777 31.5843 10.4114 9.7510 12.4014 21.2969 9.0006 36.2570
temp: 298.150 k
press: 1.00000 atm
elementType: 8 8 8 8 8 7 7 6 6 6 6 6 6 6 6 6 6 6 6 6 6 6 6 6 6 6 6 6 6 1 1 1 1 1 1 1 1 1 1 1 1 1 1 1 1 1 1 1 1 1 1 1 1 1 1 1 1
symmnumber: 1
zpe: 1235895.5 jmol-1
zpe.correction: 0.470728 hartree
zpe.thermalcorrener: 0.497306 hartree
zpe.thermalcorrenthalpy: 0.498250 hartree
zpe.thermalcorrgfe: 0.414189 hartree
zpe.sumelectzpe: -1338.563225 hartree
zpe.sumelectthermal: -1338.536647 hartree
zpe.sumelectthermalent: -1338.535703 hartree
zpe.sumelectthermalfe: -1338.619763 hartree
dipole: -0.7207 4.6909 0.1914
dipole: 4.7498
quadrupole: -197.3256 -148.5392 -175.5145
quadrupole: -3.0767 0.8689 0.9381
quadrupole: -23.5325 25.2539 -1.7214 -3.0767 0.8689 0.9381
hfenergy: -1339.0339526 hartree
pointgroup: C01 [X(C22H28N2O5)]
dipole: -0.2725501 1.8416957 0.1610941 debye
polarizability: 379.8035639|15.459697|265.8607138|2.1176108|-2.8528448|172.3276272 unknown
InChI: InChI=1S/C22H28N2O5/c1-28-12-3-4-13-14-5-6-24-10-11-7-18(25)21(29-2)19(22(26)27)15(11)9-17(24)20(14)23-16(13)8-12/h3-4,8,11,15,17-19,21,23,25-26H,5-7,9-10H2,1-2H3
charge 0 multiplicity 1
57 atoms
O  -5.359903 2.096905 -0.663473
O  -6.497041 -0.530388 -0.830887
O  -1.604033 2.127544 1.570055
O  -3.042257 0.474797 2.329402
O  7.092475 1.511965 -0.21721
N  -0.478152 -1.971016 -0.081157
N  2.127997 0.772373 -0.05238
C  -2.33807 0.152517 -1.01082
C  -2.761994 -1.346143 -0.875916
C  -0.793972 0.307107 -0.993401
C  -0.088661 -0.543197 0.095679
C  -3.104123 1.155596 -0.060808
C  -1.929579 -2.122973 0.170859
C  -4.283576 -1.505814 -0.593851
C  -4.653777 0.923307 -0.114357
C  -5.066759 -0.256632 -1.008494
C  1.412159 -0.438387 0.034809
C  0.358296 -2.911035 0.712094
C  2.306314 -1.501288 0.079871
C  1.818938 -2.923038 0.201122
C  -2.619215 1.167549 1.37603
C  3.64247 -0.941354 0.008423
C  3.499598 0.489199 -0.071728
C  -5.486771 3.198551 0.295087
C  4.953102 -1.490371 0.010936
C  4.603205 1.37053 -0.149202
C  6.062042 -0.633788 -0.065102
C  5.887704 0.781768 -0.145172
C  6.990987 2.966057 -0.308021
H  -2.668304 0.480916 -2.017197
H  -2.523476 -1.802928 -1.857182
H  -0.531622 1.376183 -0.867416
H  -0.392615 -0.026118 -1.968638
H  -0.427669 -0.18563 1.106164
H  -2.895614 2.161466 -0.470885
H  -2.210537 -1.787484 1.201195
H  -2.186288 -3.196454 0.096515
H  -4.693999 -2.381617 -1.125902
H  -4.459006 -1.672516 0.487372
H  -5.040458 0.708674 0.905346
H  -4.87143 0.008812 -2.069934
H  -0.085911 -3.9187 0.613992
H  0.351966 -2.645425 1.800277
H  1.861504 -3.440835 -0.777571
H  2.447382 -3.503969 0.904861
H  1.710928 1.698886 -0.104595
H  -6.971064 0.327552 -0.991934
H  -6.012253 2.868266 1.214828
H  -6.076188 3.979766 -0.209811
H  -4.497704 3.615392 0.576808
H  5.104221 -2.573895 0.069471
H  -1.316015 2.098981 2.523918
H  4.462121 2.453821 -0.209363
H  7.085129 -1.021459 -0.066458
H  6.490142 3.394503 0.583467
H  6.445592 3.277875 -1.221443
H  8.029062 3.327297 -0.356673
