program: Orca
programVersion: 5.0.2
elementType: S P O O O N C C C C C C C C C C C C C H H H H H H H H H H H H H H H H H H H H H H
charge: 0
multiplicity: 1
keywords: wb97x-d3
keywords: def2-TZVPP
keywords: def2/J RIJCOSX
keywords: DEFGRID2
keywords: scfconv7
keywords: smallprint printgap noloewdin
keywords: NOSOSCF
formula: C13H22NO3PS
InChI: InChI=1/C13H22NO3PS/c1-6-16-18(15,14-10(2)3)17-12-7-8-13(19-5)11(4)9-12/h7-10,14H,6H2,1-5H3
41 atoms
S  -4.817114 -1.007804 0.01421
P  2.011992 0.707951 0.287498
O  0.592809 1.384431 -0.128841
O  2.863132 1.934963 -0.266962
O  2.145857 0.403936 1.73485
N  2.311103 -0.576294 -0.675057
C  2.33495 -1.980543 -0.261808
C  3.669426 -2.607189 -0.634695
C  1.169693 -2.744375 -0.871655
C  -0.633254 0.764875 -0.101273
C  -2.259075 -0.740157 0.85984
C  -0.981542 -0.193276 0.841384
C  4.26566 2.049419 0.041853
C  -1.558209 1.180732 -1.04299
C  -3.20344 -0.302557 -0.081562
C  -2.839121 0.65169 -1.02624
C  -2.613139 -1.772253 1.885636
C  4.481601 2.96738 1.220021
C  -5.728001 -0.143727 -1.276391
H  2.235268 -1.998226 0.823754
H  2.335105 -0.422509 -1.675904
H  3.707785 -3.648776 -0.314141
H  3.821896 -2.586381 -1.716038
H  4.498985 -2.078241 -0.164837
H  1.186097 -3.786977 -0.55275
H  1.221295 -2.729124 -1.962588
H  0.21335 -2.314931 -0.571752
H  -0.271011 -0.518396 1.590785
H  4.705543 1.065891 0.224489
H  4.733751 2.450354 -0.855904
H  -1.287453 1.924006 -1.781944
H  -3.545813 1.000999 -1.76604
H  -2.932664 -2.707691 1.420857
H  -1.763033 -1.996342 2.52748
H  -3.433172 -1.438252 2.525547
H  5.5507 3.102052 1.384089
H  4.045438 3.950285 1.040223
H  4.050763 2.557879 2.133297
H  -6.744289 -0.532604 -1.236073
H  -5.324357 -0.343728 -2.267299
H  -5.765362 0.929972 -1.099867
elementType: S P O N C H
totalener: -1528.84322521 hartree
nucrepener: 1820.44799860 hartree
electener: -3349.29122382 hartree
oneelecener: -5717.31935367 hartree
twoeener: 2368.02812986 hartree
cpcmener: -0.03685985 hartree
kineticenergy: 1523.70420720 hartree
xcener: -113.009572230346 hartree
chargesum: 0.0000000
charge: -0.076153 0.854535 -0.346539 -0.371224 -0.666937 -0.231064 0.118739 -0.271156 -0.272555 0.247171 0.049293 -0.198244 0.045489 -0.247946 -0.058377 -0.145647 -0.235494 -0.247967 -0.274556 0.064741 0.158900 0.089474 0.088792 0.090742 0.091988 0.092023 0.090491 0.132048 0.087289 0.104732 0.148088 0.147853 0.102330 0.095660 0.104774 0.095762 0.087956 0.078085 0.134181 0.121181 0.121543
qa: -0.0762 0.8545 -0.3465 -0.3712 -0.6669 -0.2311 0.1187 -0.2712 -0.2726 0.2472 0.0493 -0.1982 0.0455 -0.2479 -0.0584 -0.1456 -0.2355 -0.2480 -0.2746 0.0647 0.1589 0.0895 0.0888 0.0907 0.0920 0.0920 0.0905 0.1320 0.0873 0.1047 0.1481 0.1479 0.1023 0.0957 0.1048 0.0958 0.0880 0.0781 0.1342 0.1212 0.1215
va: 2.3826 5.5417 2.1052 2.0844 1.8947 3.0922 3.8255 3.9393 3.9312 3.7544 3.6510 3.8067 3.8867 4.0482 3.9621 3.8600 3.8944 3.9301 3.9883 1.0257 1.0221 1.0058 1.0035 1.0087 1.0081 1.0045 1.0043 1.0333 0.9997 0.9919 1.0052 0.9953 0.9990 1.0082 1.0008 1.0078 1.0043 1.0181 0.9990 0.9945 0.9958
dispcorr: -0.019212334 hartree
energy: -1528.862437546393
dipole: 9.34427 -9.01432 0.32995 -9.81469 9.16155 -0.65314 -3.28250 0.98314 -2.29937
magnitude: 2.41299 au
magnitude: 6.13334 debye
