program: Orca
programVersion: 5.0.2
elementType: S P O O O N C C C C C C C C C C C C C H H H H H H H H H H H H H H H H H H H H H H
charge: 0
multiplicity: 1
keywords: wb97x-d3
keywords: def2-TZVPP
keywords: def2/J RIJCOSX
keywords: DEFGRID2
keywords: scfconv7
keywords: smallprint printgap noloewdin
keywords: NOSOSCF
formula: C13H22NO3PS
InChI: InChI=1/C13H22NO3PS/c1-6-16-18(15,14-10(2)3)17-12-7-8-13(19-5)11(4)9-12/h7-10,14H,6H2,1-5H3
41 atoms
S  -4.932847 -0.538885 0.249492
P  1.934131 0.275273 0.140609
O  0.693094 1.198396 -0.350944
O  3.126418 1.302959 -0.121864
O  1.816074 -0.225485 1.533589
N  2.052138 -0.909104 -0.985535
C  2.814209 -2.140723 -0.735849
C  4.31713 -1.901601 -0.738274
C  2.411999 -3.175634 -1.772022
C  -0.611349 0.754995 -0.218857
C  -2.550711 0.360827 1.159939
C  -1.22789 0.759653 1.02292
C  3.30272 2.469341 0.712686
C  -1.302192 0.356054 -1.346457
C  -3.2574 -0.045448 0.01527
C  -2.627572 -0.037671 -1.225517
C  -3.200815 0.365538 2.509145
C  4.353115 2.223743 1.765679
C  -5.478192 -0.977995 -1.407988
H  2.515699 -2.506094 0.248103
H  2.085922 -0.598377 -1.950918
H  4.855679 -2.836114 -0.576713
H  4.642747 -1.486115 -1.693961
H  4.617546 -1.211232 0.051034
H  2.67124 -2.84338 -2.779855
H  1.340501 -3.373289 -1.743626
H  2.932984 -4.115102 -1.588788
H  -0.683273 1.093273 1.897363
H  3.603171 3.271569 0.039835
H  2.356948 2.76783 1.170516
H  -0.82059 0.356431 -2.315792
H  -3.154243 -0.342069 -2.119061
H  -2.507781 0.706085 3.276387
H  -4.073205 1.022405 2.53537
H  -3.544453 -0.631877 2.792472
H  5.306602 1.941235 1.319331
H  4.509812 3.139862 2.33574
H  4.047548 1.44378 2.462606
H  -5.437874 -0.130794 -2.090517
H  -6.517554 -1.287488 -1.309108
H  -4.911462 -1.812371 -1.817807
elementType: S P O N C H
totalener: -1528.84558851 hartree
nucrepener: 1810.64912838 hartree
electener: -3339.49471690 hartree
oneelecener: -5698.15927995 hartree
twoeener: 2358.66456305 hartree
cpcmener: -0.03742674 hartree
kineticenergy: 1523.70908357 hartree
xcener: -113.003674081481 hartree
chargesum: -0.0000000
charge: -0.074634 0.911314 -0.387260 -0.375011 -0.673900 -0.275136 0.101892 -0.266166 -0.267721 0.277867 0.023680 -0.174161 0.052962 -0.267508 -0.045590 -0.143656 -0.229277 -0.253026 -0.274834 0.067308 0.159986 0.090960 0.088026 0.083735 0.089835 0.093149 0.089090 0.137630 0.106246 0.091439 0.148893 0.149234 0.095772 0.100800 0.101945 0.088811 0.098478 0.080390 0.122378 0.134005 0.122056
qa: -0.0746 0.9113 -0.3873 -0.3750 -0.6739 -0.2751 0.1019 -0.2662 -0.2677 0.2779 0.0237 -0.1742 0.0530 -0.2675 -0.0456 -0.1437 -0.2293 -0.2530 -0.2748 0.0673 0.1600 0.0910 0.0880 0.0837 0.0898 0.0931 0.0891 0.1376 0.1062 0.0914 0.1489 0.1492 0.0958 0.1008 0.1019 0.0888 0.0985 0.0804 0.1224 0.1340 0.1221
va: 2.3846 5.5266 2.0759 2.0652 1.9035 3.1492 3.8784 3.9144 3.9275 3.6932 3.6773 3.9633 3.8622 4.1136 3.9526 3.8466 3.8940 3.9287 3.9875 1.0223 1.0226 1.0091 1.0061 1.0138 1.0025 1.0101 1.0048 1.0212 0.9930 1.0005 1.0049 0.9954 1.0080 1.0002 1.0000 1.0031 1.0090 1.0174 0.9947 0.9990 0.9953
dispcorr: -0.018251643 hartree
energy: -1528.863840158334
dipole: 11.62684 -11.45363 0.17320 -6.88464 6.99413 0.10949 -2.55157 0.47469 -2.07688
magnitude: 2.08696 au
magnitude: 5.30463 debye
