program: Orca
programVersion: 5.0.2
elementType: S P O O O N C C C C C C C C C C C C C H H H H H H H H H H H H H H H H H H H H H H
charge: 0
multiplicity: 1
keywords: wb97x-d3
keywords: def2-TZVPP
keywords: def2/J RIJCOSX
keywords: DEFGRID2
keywords: scfconv7
keywords: smallprint printgap noloewdin
keywords: NOSOSCF
formula: C13H22NO3PS
InChI: InChI=1/C13H22NO3PS/c1-6-16-18(15,14-10(2)3)17-12-7-8-13(19-5)11(4)9-12/h7-10,14H,6H2,1-5H3
41 atoms
S  -4.820997 -0.945096 0.057108
P  1.965165 0.928933 0.465578
O  0.714665 1.052726 -0.562418
O  3.054181 1.299893 -0.639008
O  1.884034 1.821565 1.649249
N  2.170897 -0.635807 0.875817
C  2.321375 -1.757094 -0.05231
C  1.152508 -2.720323 0.082677
C  3.653517 -2.451694 0.182456
C  -0.550666 0.568365 -0.320492
C  -2.612367 -0.20231 -1.323818
C  -1.309287 0.257763 -1.440843
C  4.398753 1.622994 -0.226039
C  -1.086537 0.410613 0.945606
C  -3.159096 -0.364953 -0.03922
C  -2.387221 -0.060971 1.075182
C  -3.410279 -0.520078 -2.550466
C  4.58917 3.116988 -0.144039
C  -5.142973 -0.994822 1.826898
H  2.319221 -1.350737 -1.065998
H  2.003492 -0.881574 1.842598
H  0.204114 -2.233204 -0.146391
H  1.271123 -3.563118 -0.598818
H  1.093404 -3.119133 1.097739
H  4.485486 -1.759074 0.049637
H  3.786996 -3.277709 -0.516766
H  3.707772 -2.857953 1.194676
H  -0.877138 0.381817 -2.426758
H  4.637972 1.145012 0.726884
H  5.05219 1.185569 -0.979372
H  -0.53188 0.659202 1.840464
H  -2.784311 -0.177394 2.073751
H  -2.829235 -0.340488 -3.453326
H  -3.73025 -1.564427 -2.564387
H  -4.313927 0.090484 -2.610475
H  5.626776 3.3349 0.109816
H  4.3708 3.598427 -1.097314
H  3.956549 3.561433 0.623895
H  -5.065955 -0.009999 2.284501
H  -4.489977 -1.69647 2.343155
H  -6.169456 -1.3420 1.934372
elementType: S P O N C H
totalener: -1528.84540246 hartree
nucrepener: 1826.27249395 hartree
electener: -3355.11789641 hartree
oneelecener: -5728.68787375 hartree
twoeener: 2373.56997735 hartree
cpcmener: -0.03763527 hartree
kineticenergy: 1523.70488784 hartree
xcener: -113.009545183997 hartree
chargesum: -0.0000000
charge: -0.078156 0.806583 -0.338945 -0.366492 -0.662624 -0.239595 0.128654 -0.275585 -0.272137 0.224053 0.026429 -0.158373 0.045335 -0.227506 -0.036779 -0.162025 -0.228417 -0.247284 -0.274848 0.071094 0.169761 0.083858 0.094814 0.092958 0.091854 0.090927 0.088580 0.131344 0.089914 0.107868 0.136349 0.148664 0.095830 0.101502 0.101769 0.096094 0.088630 0.078253 0.121430 0.122029 0.134192
qa: -0.0782 0.8066 -0.3389 -0.3665 -0.6626 -0.2396 0.1287 -0.2756 -0.2721 0.2241 0.0264 -0.1584 0.0453 -0.2275 -0.0368 -0.1620 -0.2284 -0.2473 -0.2748 0.0711 0.1698 0.0839 0.0948 0.0930 0.0919 0.0909 0.0886 0.1313 0.0899 0.1079 0.1363 0.1487 0.0958 0.1015 0.1018 0.0961 0.0886 0.0783 0.1214 0.1220 0.1342
va: 2.3813 5.5557 2.1053 2.0634 1.9139 3.0475 3.8042 3.9420 3.9497 3.7439 3.7029 3.9347 3.8482 3.9359 3.9330 3.8957 3.8872 3.9499 3.9896 1.0201 1.0186 1.0066 1.0081 1.0044 1.0056 1.0061 1.0035 1.0134 1.0021 0.9915 1.0323 0.9980 1.0075 1.0001 1.0003 1.0073 1.0039 1.0185 0.9953 0.9949 0.9990
dispcorr: -0.019713021 hartree
energy: -1528.865115480154
dipole: 9.71167 -9.12551 0.58616 -10.90731 8.75333 -2.15398 -0.60083 0.58526 -0.01557
magnitude: 2.23237 au
magnitude: 5.67423 debye
