program: Orca
programVersion: 5.0.2
elementType: S P O O O N C C C C C C C C C C C C C H H H H H H H H H H H H H H H H H H H H H H
charge: 0
multiplicity: 1
keywords: wb97x-d3
keywords: def2-TZVPP
keywords: def2/J RIJCOSX
keywords: DEFGRID2
keywords: scfconv7
keywords: smallprint printgap noloewdin
keywords: NOSOSCF
formula: C13H22NO3PS
InChI: InChI=1/C13H22NO3PS/c1-6-16-18(15,14-10(2)3)17-12-7-8-13(19-5)11(4)9-12/h7-10,14H,6H2,1-5H3
41 atoms
S  -4.684857 0.935987 -0.397411
P  2.050762 0.019529 0.6651
O  0.803437 -1.029093 0.635627
O  1.983195 0.607238 -0.817465
O  1.960326 1.022783 1.754935
N  3.381892 -0.926092 0.728152
C  3.697138 -2.015638 -0.201116
C  3.230238 -3.362406 0.331604
C  5.191554 -2.020669 -0.477989
C  -0.47706 -0.546041 0.425832
C  -2.349227 -0.25234 -1.068078
C  -1.059028 -0.703203 -0.822399
C  1.990182 2.024896 -1.085338
C  -1.16907 0.07043 1.451657
C  -3.054013 0.3793 -0.028797
C  -2.457821 0.529926 1.219148
C  -2.965557 -0.430433 -2.42156
C  0.586743 2.57238 -1.16359
C  -5.228046 1.700275 1.139203
H  3.17695 -1.808588 -1.138397
H  3.771203 -1.043146 1.656412
H  3.479667 -4.159149 -0.369964
H  3.717049 -3.592162 1.282009
H  2.15242 -3.383366 0.489278
H  5.448856 -2.816317 -1.177479
H  5.756707 -2.191313 0.441088
H  5.51931 -1.07421 -0.907665
H  -0.502851 -1.186046 -1.617081
H  2.575248 2.552276 -0.330401
H  2.505776 2.139128 -2.037796
H  -0.72519 0.184253 2.431645
H  -2.984024 1.007801 2.033432
H  -2.27656 -0.925942 -3.103255
H  -3.875552 -1.032938 -2.373656
H  -3.240933 0.528069 -2.867441
H  0.00297 2.066659 -1.932957
H  0.062417 2.481406 -0.211363
H  0.63051 3.63137 -1.420392
H  -5.279297 0.984535 1.95781
H  -6.233442 2.072198 0.947755
H  -4.599698 2.54349 1.420678
elementType: S P O N C H
totalener: -1528.84493588 hartree
nucrepener: 1843.30063860 hartree
electener: -3372.14557448 hartree
oneelecener: -5763.28504144 hartree
twoeener: 2391.13946696 hartree
cpcmener: -0.03460482 hartree
kineticenergy: 1523.70228369 hartree
xcener: -113.005578828024 hartree
chargesum: 0.0000000
charge: -0.074766 0.849346 -0.371999 -0.367118 -0.667902 -0.274380 0.115812 -0.279266 -0.264515 0.292941 0.038779 -0.220674 0.057008 -0.243808 -0.024510 -0.157735 -0.230132 -0.259225 -0.275298 0.070691 0.162713 0.091331 0.088142 0.090074 0.088116 0.088552 0.090892 0.133131 0.091741 0.104894 0.145560 0.148474 0.096271 0.104781 0.101452 0.089822 0.082890 0.108915 0.122011 0.134193 0.122793
qa: -0.0748 0.8493 -0.3720 -0.3671 -0.6679 -0.2744 0.1158 -0.2793 -0.2645 0.2929 0.0388 -0.2207 0.0570 -0.2438 -0.0245 -0.1577 -0.2301 -0.2592 -0.2753 0.0707 0.1627 0.0913 0.0881 0.0901 0.0881 0.0886 0.0909 0.1331 0.0917 0.1049 0.1456 0.1485 0.0963 0.1048 0.1015 0.0898 0.0829 0.1089 0.1220 0.1342 0.1228
va: 2.3847 5.5540 2.0358 2.0499 1.9254 3.1120 3.8538 3.9393 3.9336 3.6218 3.6203 3.9805 3.8418 4.0865 3.9280 3.8797 3.8869 3.9169 3.9882 1.0192 1.0215 1.0065 1.0041 1.0160 1.0049 1.0042 1.0113 1.0131 1.0081 0.9928 1.0146 0.9968 1.0076 0.9996 1.0010 1.0018 1.0080 1.0118 0.9947 0.9991 0.9951
dispcorr: -0.020106185 hartree
energy: -1528.865042066182
dipole: 7.10882 -6.92112 0.18770 -2.84621 2.42427 -0.42194 -7.21510 6.30156 -0.91354
magnitude: 1.02363 au
magnitude: 2.60186 debye
