program: Orca
programVersion: 5.0.2
elementType: S P O O O N C C C C C C C C C C C C C H H H H H H H H H H H H H H H H H H H H H H
charge: 0
multiplicity: 1
keywords: wb97x-d3
keywords: def2-TZVPP
keywords: def2/J RIJCOSX
keywords: DEFGRID2
keywords: scfconv7
keywords: smallprint printgap noloewdin
keywords: NOSOSCF
formula: C13H22NO3PS
InChI: InChI=1/C13H22NO3PS/c1-6-16-18(15,14-10(2)3)17-12-7-8-13(19-5)11(4)9-12/h7-10,14H,6H2,1-5H3
41 atoms
S  -4.672807 -0.794515 -0.089191
P  2.197817 0.348988 0.698676
O  0.943844 1.080971 -0.035019
O  3.390643 1.088099 -0.063767
O  2.217834 0.489763 2.176266
N  2.152916 -1.193322 0.175551
C  2.092283 -1.634328 -1.219622
C  1.037635 -2.718767 -1.366215
C  3.456188 -2.105987 -1.69902
C  -0.35178 0.614487 -0.019257
C  -2.202448 -0.560103 0.994852
C  -0.883859 -0.122996 1.029912
C  3.98838 2.304369 0.429691
C  -1.138048 0.933868 -1.111185
C  -3.003716 -0.228061 -0.108852
C  -2.46007 0.518269 -1.149354
C  -2.747926 -1.37212 2.129285
C  3.117503 3.51749 0.215052
C  -5.370224 -0.088372 -1.590094
H  1.786954 -0.777499 -1.823907
H  2.469541 -1.892766 0.834629
H  0.972196 -3.051963 -2.402175
H  1.28436 -3.587455 -0.752149
H  0.054317 -2.356588 -1.06464
H  4.19889 -1.311404 -1.625447
H  3.409688 -2.427222 -2.739946
H  3.804318 -2.952861 -1.10395
H  -0.289087 -0.364963 1.901265
H  4.242318 2.186541 1.484416
H  4.920319 2.4004 -0.124157
H  -0.726911 1.507791 -1.931577
H  -3.053444 0.785992 -2.012009
H  -3.600799 -0.882018 2.604298
H  -3.091576 -2.352438 1.791736
H  -1.991033 -1.534598 2.89438
H  3.681427 4.406768 0.497413
H  2.828701 3.623862 -0.830336
H  2.216527 3.494258 0.827967
H  -4.890275 -0.473519 -2.4880
H  -5.328765 0.999609 -1.584882
H  -6.416084 -0.390733 -1.606339
elementType: S P O N C H
totalener: -1528.84458569 hartree
nucrepener: 1842.69075839 hartree
electener: -3371.53534408 hartree
oneelecener: -5761.79160192 hartree
twoeener: 2390.25625784 hartree
cpcmener: -0.03492280 hartree
kineticenergy: 1523.70825964 hartree
xcener: -113.010439158119 hartree
chargesum: 0.0000000
charge: -0.076064 0.827952 -0.348924 -0.362650 -0.660749 -0.248141 0.121247 -0.268712 -0.273303 0.262619 0.045152 -0.188318 0.035107 -0.242188 -0.064435 -0.136918 -0.230510 -0.246657 -0.274365 0.072235 0.161694 0.092864 0.092889 0.084409 0.088611 0.090712 0.089735 0.118694 0.092377 0.103684 0.147966 0.147934 0.100977 0.102498 0.094497 0.099384 0.088249 0.083728 0.120741 0.122147 0.133834
qa: -0.0761 0.8280 -0.3489 -0.3627 -0.6607 -0.2481 0.1212 -0.2687 -0.2733 0.2626 0.0452 -0.1883 0.0351 -0.2422 -0.0644 -0.1369 -0.2305 -0.2467 -0.2744 0.0722 0.1617 0.0929 0.0929 0.0844 0.0886 0.0907 0.0897 0.1187 0.0924 0.1037 0.1480 0.1479 0.1010 0.1025 0.0945 0.0994 0.0882 0.0837 0.1207 0.1221 0.1338
va: 2.3827 5.5350 2.0773 2.0724 1.9197 3.0704 3.8208 3.9278 3.9487 3.7057 3.6828 3.8832 3.8647 4.0351 3.9632 3.8477 3.8949 3.8976 3.9883 1.0177 1.0214 1.0067 1.0044 1.0059 1.0132 1.0060 1.0034 1.0465 1.0064 0.9898 1.0062 0.9952 1.0014 0.9986 1.0091 1.0088 1.0057 1.0144 0.9946 0.9956 0.9993
dispcorr: -0.019863229 hartree
energy: -1528.864448914929
dipole: 3.96089 -3.97902 -0.01813 -4.56544 4.15038 -0.41506 -9.50164 7.31970 -2.18194
magnitude: 2.22114 au
magnitude: 5.64569 debye
