program: Orca
programVersion: 5.0.2
elementType: S P O O O N C C C C C C C C C C C C C H H H H H H H H H H H H H H H H H H H H H H
charge: 0
multiplicity: 1
keywords: wb97x-d3
keywords: def2-TZVPP
keywords: def2/J RIJCOSX
keywords: DEFGRID2
keywords: scfconv7
keywords: smallprint printgap noloewdin
keywords: NOSOSCF
formula: C13H22NO3PS
InChI: InChI=1/C13H22NO3PS/c1-6-16-18(15,14-10(2)3)17-12-7-8-13(19-5)11(4)9-12/h7-10,14H,6H2,1-5H3
41 atoms
S  -4.8264 -0.550862 -0.046091
P  2.133516 0.524128 0.666179
O  0.930968 0.755277 -0.401645
O  3.348104 1.029156 -0.23813
O  1.961081 1.232827 1.954166
N  2.264729 -1.099634 0.801913
C  2.463903 -2.041688 -0.302162
C  1.59001 -3.267105 -0.084969
C  3.931216 -2.416506 -0.449514
C  -0.383823 0.412064 -0.218049
C  -2.562747 0.299312 -1.267342
C  -1.208624 0.591616 -1.321067
C  3.842064 2.380895 -0.178282
C  -0.911951 -0.071543 0.967257
C  -3.099687 -0.194588 -0.066402
C  -2.266431 -0.374182 1.029835
C  -3.425199 0.510109 -2.473568
C  2.963833 3.36033 -0.917663
C  -5.121347 -1.10031 1.641105
H  2.135629 -1.547646 -1.219403
H  2.575375 -1.431085 1.706994
H  1.7075 -3.975741 -0.905777
H  1.860577 -3.783214 0.839209
H  0.535787 -2.994665 -0.024054
H  4.550789 -1.537786 -0.628914
H  4.073705 -3.102566 -1.285479
H  4.299008 -2.911583 0.45245
H  -0.78381 0.973209 -2.242231
H  3.971698 2.680224 0.863359
H  4.831397 2.336363 -0.632479
H  -0.31043 -0.218691 1.853343
H  -2.652814 -0.750848 1.966442
H  -4.23509 1.215122 -2.272058
H  -2.845109 0.9039 -3.306937
H  -3.8888 -0.421597 -2.80685
H  3.455132 4.334213 -0.930286
H  2.803604 3.054115 -1.951646
H  1.993963 3.490711 -0.436495
H  -4.57939 -2.014922 1.878585
H  -6.187906 -1.312269 1.704762
H  -4.884654 -0.328139 2.371825
elementType: S P O N C H
totalener: -1528.85472042 hartree
nucrepener: 1825.30664887 hartree
electener: -3354.16136929 hartree
oneelecener: -5726.92686304 hartree
twoeener: 2372.76549376 hartree
cpcmener: -0.02875732 hartree
kineticenergy: 1523.70266616 hartree
xcener: -113.006720020463 hartree
chargesum: 0.0000000
charge: -0.076627 0.819913 -0.333586 -0.356888 -0.627011 -0.259372 0.108357 -0.267621 -0.272411 0.296461 0.036407 -0.185372 0.035458 -0.251117 -0.049787 -0.153210 -0.229048 -0.247374 -0.276235 0.071683 0.156079 0.090773 0.088862 0.091783 0.089140 0.089516 0.086634 0.128214 0.091357 0.100155 0.122252 0.142416 0.101891 0.093727 0.101654 0.096763 0.086967 0.086111 0.120304 0.131978 0.120806
qa: -0.0766 0.8199 -0.3336 -0.3569 -0.6270 -0.2594 0.1084 -0.2676 -0.2724 0.2965 0.0364 -0.1854 0.0355 -0.2511 -0.0498 -0.1532 -0.2290 -0.2474 -0.2762 0.0717 0.1561 0.0908 0.0889 0.0918 0.0891 0.0895 0.0866 0.1282 0.0914 0.1002 0.1223 0.1424 0.1019 0.0937 0.1017 0.0968 0.0870 0.0861 0.1203 0.1320 0.1208
va: 2.3798 5.5568 2.0992 2.0823 1.9654 3.0575 3.8510 3.9319 3.9419 3.6881 3.6961 3.9766 3.8692 3.9995 3.9440 3.9025 3.8887 3.9009 3.9929 1.0180 1.0248 1.0063 1.0041 1.0045 1.0146 1.0066 1.0039 1.0143 1.0069 0.9897 1.0445 0.9993 1.0002 1.0077 0.9993 1.0092 1.0054 1.0133 0.9946 1.0002 0.9952
dispcorr: -0.019020657 hartree
energy: -1528.873741077319
dipole: 6.17243 -5.69154 0.48089 -7.37326 6.16828 -1.20497 -5.43839 4.84928 -0.58910
magnitude: 1.42487 au
magnitude: 3.62174 debye
