program: Orca
programVersion: 5.0.2
elementType: S P O O O N C C C C C C C C C C C C C H H H H H H H H H H H H H H H H H H H H H H
charge: 0
multiplicity: 1
keywords: wb97x-d3
keywords: def2-TZVPP
keywords: def2/J RIJCOSX
keywords: DEFGRID2
keywords: scfconv7
keywords: smallprint printgap noloewdin
keywords: NOSOSCF
formula: C13H22NO3PS
InChI: InChI=1/C13H22NO3PS/c1-6-16-18(15,14-10(2)3)17-12-7-8-13(19-5)11(4)9-12/h7-10,14H,6H2,1-5H3
41 atoms
S  -4.902995 0.960753 0.3877
P  1.985786 -0.391763 0.16374
O  0.6486 -0.813023 -0.662135
O  1.847399 1.192714 0.062846
O  2.068931 -0.967179 1.526151
N  3.234439 -0.811525 -0.809044
C  3.905837 -2.113035 -0.730004
C  5.310697 -1.97368 -1.292226
C  3.122434 -3.208951 -1.438482
C  -0.626113 -0.382449 -0.385629
C  -2.355537 0.395535 1.112079
C  -1.0499 -0.022563 0.886891
C  2.525957 2.081274 0.970295
C  -1.513807 -0.339987 -1.446116
C  -3.257165 0.431926 0.037392
C  -2.824096 0.058187 -1.230374
C  -2.781271 0.794708 2.49151
C  1.575661 3.177167 1.378692
C  -5.742261 0.789739 -1.194511
H  3.985081 -2.365938 0.328734
H  3.250152 -0.39113 -1.730682
H  5.289143 -1.701926 -2.35021
H  5.877629 -1.21119 -0.757389
H  5.850652 -2.916715 -1.205441
H  2.137158 -3.3500 -0.992076
H  3.648832 -4.162368 -1.37736
H  2.983723 -2.970827 -2.495308
H  -0.376419 -0.076202 1.732991
H  2.879837 1.536978 1.847635
H  3.397958 2.486576 0.45536
H  -1.19033 -0.619868 -2.440775
H  -3.49541 0.078475 -2.07744
H  -1.957221 0.707364 3.198031
H  -3.130959 1.829548 2.520804
H  -3.599393 0.170875 2.859408
H  0.712451 2.777386 1.911088
H  2.08842 3.870586 2.045323
H  1.221174 3.744312 0.517577
H  -6.776729 1.082993 -1.019647
H  -5.737432 -0.239508 -1.550878
H  -5.327385 1.448623 -1.955899
elementType: S P O N C H
totalener: -1528.85472474 hartree
nucrepener: 1809.86616658 hartree
electener: -3338.72089132 hartree
oneelecener: -5696.26025493 hartree
twoeener: 2357.53936361 hartree
cpcmener: -0.02920908 hartree
kineticenergy: 1523.70579173 hartree
xcener: -113.004744621948 hartree
chargesum: -0.0000000
charge: -0.073518 0.871733 -0.352269 -0.358498 -0.636741 -0.272890 0.104127 -0.265898 -0.266872 0.276943 0.051718 -0.194986 0.048826 -0.258585 -0.055155 -0.141953 -0.239026 -0.250065 -0.276172 0.066557 0.152648 0.087790 0.092841 0.087642 0.088461 0.089519 0.085083 0.120557 0.089546 0.100136 0.143511 0.143556 0.094114 0.101886 0.103879 0.083892 0.094680 0.090008 0.132028 0.120951 0.119995
qa: -0.0735 0.8717 -0.3523 -0.3585 -0.6367 -0.2729 0.1041 -0.2659 -0.2669 0.2769 0.0517 -0.1950 0.0488 -0.2586 -0.0552 -0.1420 -0.2390 -0.2501 -0.2762 0.0666 0.1526 0.0878 0.0928 0.0876 0.0885 0.0895 0.0851 0.1206 0.0895 0.1001 0.1435 0.1436 0.0941 0.1019 0.1039 0.0839 0.0947 0.0900 0.1320 0.1210 0.1200
va: 2.3829 5.5441 2.1108 2.0783 1.9518 3.1298 3.8824 3.9218 3.9174 3.7454 3.6825 3.8626 3.8518 4.0807 3.9637 3.8585 3.8980 3.9450 3.9907 1.0235 1.0274 1.0029 1.0110 1.0053 1.0153 1.0085 1.0062 1.0459 1.0048 0.9950 1.0079 0.9968 1.0082 0.9986 1.0014 1.0033 1.0087 1.0036 0.9998 0.9953 0.9944
dispcorr: -0.018262236 hartree
energy: -1528.872986975746
dipole: 10.11510 -9.66081 0.45429 0.45285 0.36202 0.81487 -3.07150 1.30350 -1.76800
magnitude: 1.99906 au
magnitude: 5.08120 debye
