program: Orca
programVersion: 5.0.2
elementType: S P O O O N C C C C C C C C C C C C C H H H H H H H H H H H H H H H H H H H H H H
charge: 0
multiplicity: 1
keywords: wb97x-d3
keywords: def2-TZVPP
keywords: def2/J RIJCOSX
keywords: DEFGRID2
keywords: scfconv7
keywords: smallprint printgap noloewdin
keywords: NOSOSCF
formula: C13H22NO3PS
InChI: InChI=1/C13H22NO3PS/c1-6-16-18(15,14-10(2)3)17-12-7-8-13(19-5)11(4)9-12/h7-10,14H,6H2,1-5H3
41 atoms
S  -4.857885 -0.64693 0.036722
P  2.084065 0.364583 0.697821
O  0.855544 0.888512 -0.231087
O  3.260036 1.191804 0.009106
O  1.889702 0.593427 2.146977
N  2.318782 -1.197282 0.291638
C  2.548157 -1.709346 -1.060104
C  1.757804 -2.993912 -1.251785
C  4.031928 -1.911217 -1.330705
C  -0.458203 0.509835 -0.123674
C  -2.272135 -0.772523 0.830378
C  -0.9265 -0.425406 0.790956
C  3.332882 2.627521 0.132327
C  -1.341872 1.114245 -1.001914
C  -3.165135 -0.161429 -0.062311
C  -2.686229 0.779532 -0.967907
C  -2.747508 -1.788192 1.823972
C  4.745975 3.01998 0.477188
C  -5.663692 0.391011 -1.192376
H  2.163402 -0.964763 -1.760672
H  2.619928 -1.803702 1.043796
H  2.094326 -3.767761 -0.557867
H  0.692408 -2.830108 -1.086243
H  1.886787 -3.378471 -2.26423
H  4.457517 -2.646849 -0.644298
H  4.587009 -0.980145 -1.214279
H  4.195033 -2.272183 -2.347325
H  -0.261889 -0.908864 1.494486
H  3.024185 3.060616 -0.82039
H  2.644252 2.989124 0.899589
H  -0.985477 1.846745 -1.715167
H  -3.350509 1.269766 -1.665968
H  -1.924176 -2.154031 2.435523
H  -3.500204 -1.372904 2.498268
H  -3.201414 -2.65235 1.332883
H  5.453981 2.680848 -0.279701
H  4.815126 4.106839 0.535602
H  5.045898 2.612901 1.4432
H  -5.306528 0.191586 -2.201725
H  -5.562149 1.45119 -0.964442
H  -6.721969 0.135675 -1.151579
elementType: S P O N C H
totalener: -1528.85586020 hartree
nucrepener: 1816.33348806 hartree
electener: -3345.18934826 hartree
oneelecener: -5708.91793752 hartree
twoeener: 2363.72858926 hartree
cpcmener: -0.02967495 hartree
kineticenergy: 1523.70146975 hartree
xcener: -113.005592158731 hartree
chargesum: -0.0000000
charge: -0.073967 0.806449 -0.333772 -0.351656 -0.624830 -0.255480 0.103911 -0.265072 -0.272151 0.308309 0.031034 -0.177867 0.044388 -0.251943 -0.073914 -0.142325 -0.232790 -0.245336 -0.276256 0.071395 0.159289 0.088661 0.092584 0.090440 0.086500 0.089536 0.089625 0.105566 0.098220 0.091002 0.143328 0.145161 0.093294 0.101577 0.100738 0.087199 0.090002 0.086489 0.119839 0.120765 0.132061
qa: -0.0740 0.8064 -0.3338 -0.3517 -0.6248 -0.2555 0.1039 -0.2651 -0.2722 0.3083 0.0310 -0.1779 0.0444 -0.2519 -0.0739 -0.1423 -0.2328 -0.2453 -0.2763 0.0714 0.1593 0.0887 0.0926 0.0904 0.0865 0.0895 0.0896 0.1056 0.0982 0.0910 0.1433 0.1452 0.0933 0.1016 0.1007 0.0872 0.0900 0.0865 0.1198 0.1208 0.1321
va: 2.3821 5.5909 2.0972 2.0896 1.9704 3.0500 3.8540 3.9318 3.9404 3.6986 3.7104 3.8623 3.8484 4.0565 3.9759 3.8571 3.8963 3.9595 3.9917 1.0179 1.0227 1.0039 1.0048 1.0064 1.0043 1.0161 1.0065 1.0555 0.9954 1.0008 1.0075 0.9962 1.0092 1.0008 0.9988 1.0033 1.0075 1.0065 0.9945 0.9952 0.9998
dispcorr: -0.018700618 hartree
energy: -1528.874560819616
dipole: 9.39669 -9.19229 0.20440 -5.02003 4.83390 -0.18613 -8.15401 6.18523 -1.96878
magnitude: 1.98809 au
magnitude: 5.05333 debye
