program: Orca
programVersion: 5.0.2
elementType: S P O O O N C C C C C C C C C C C C C H H H H H H H H H H H H H H H H H H H H H H
charge: 0
multiplicity: 1
keywords: wb97x-d3
keywords: def2-TZVPP
keywords: def2/J RIJCOSX
keywords: DEFGRID2
keywords: scfconv7
keywords: smallprint printgap noloewdin
keywords: NOSOSCF
formula: C13H22NO3PS
InChI: InChI=1/C13H22NO3PS/c1-6-16-18(15,14-10(2)3)17-12-7-8-13(19-5)11(4)9-12/h7-10,14H,6H2,1-5H3
41 atoms
S  -4.776001 0.855147 0.249842
P  2.100166 -0.109601 0.110132
O  0.822936 -0.881482 -0.54351
O  2.282775 1.19139 -0.797049
O  1.919531 0.155653 1.55713
N  3.371757 -1.042676 -0.353777
C  3.442716 -2.497513 -0.159223
C  3.085598 -2.894187 1.263614
C  4.85056 -2.949146 -0.508359
C  -0.469069 -0.468882 -0.301134
C  -2.484536 0.551168 -1.157607
C  -1.165494 0.152351 -1.32653
C  2.230149 2.527009 -0.258138
C  -1.078649 -0.700291 0.918131
C  -3.103499 0.325059 0.083124
C  -2.394703 -0.301805 1.103066
C  -3.220796 1.211113 -2.282508
C  0.818183 3.051829 -0.187927
C  -5.168561 0.476691 1.964059
H  2.744397 -2.996878 -0.84093
H  3.814086 -0.734871 -1.21114
H  3.229109 -3.968272 1.384845
H  3.722605 -2.385559 1.988767
H  2.044895 -2.68582 1.512848
H  5.58326 -2.51385 0.173581
H  5.12266 -2.664507 -1.526922
H  4.926115 -4.034677 -0.441126
H  -0.675532 0.323618 -2.277787
H  2.708971 2.557904 0.721814
H  2.832332 3.130605 -0.936756
H  -0.551632 -1.198548 1.720476
H  -2.852853 -0.493123 2.063284
H  -2.585061 1.312622 -3.160819
H  -4.102829 0.638294 -2.579084
H  -3.567186 2.210449 -2.008403
H  0.335597 3.037451 -1.165496
H  0.206269 2.482448 0.512816
H  0.839542 4.086875 0.157158
H  -4.523935 1.012847 2.659379
H  -5.130944 -0.591901 2.171559
H  -6.192199 0.815491 2.120314
elementType: S P O N C H
totalener: -1528.85258045 hartree
nucrepener: 1833.93026346 hartree
electener: -3362.78284391 hartree
oneelecener: -5744.49565114 hartree
twoeener: 2381.71280723 hartree
cpcmener: -0.02946768 hartree
kineticenergy: 1523.69603187 hartree
xcener: -113.002229359472 hartree
chargesum: -0.0000000
charge: -0.072752 0.837525 -0.360396 -0.377410 -0.632635 -0.273835 0.103729 -0.268284 -0.264834 0.268487 0.054522 -0.226009 0.048770 -0.206710 -0.026503 -0.165963 -0.231328 -0.252712 -0.276915 0.064550 0.160768 0.092443 0.092794 0.087007 0.085703 0.092648 0.086698 0.128531 0.091454 0.102620 0.142800 0.145817 0.094210 0.103110 0.101385 0.086642 0.083391 0.105749 0.122085 0.120212 0.132638
qa: -0.0728 0.8375 -0.3604 -0.3774 -0.6326 -0.2738 0.1037 -0.2683 -0.2648 0.2685 0.0545 -0.2260 0.0488 -0.2067 -0.0265 -0.1660 -0.2313 -0.2527 -0.2769 0.0646 0.1608 0.0924 0.0928 0.0870 0.0857 0.0926 0.0867 0.1285 0.0915 0.1026 0.1428 0.1458 0.0942 0.1031 0.1014 0.0866 0.0834 0.1057 0.1221 0.1202 0.1326
va: 2.3837 5.5635 2.0447 2.0828 1.9413 3.1209 3.8675 3.9114 3.9280 3.6829 3.6436 3.9849 3.8641 4.0301 3.9359 3.8793 3.8879 3.9057 3.9906 1.0096 1.0240 1.0090 1.0108 1.0111 1.0091 1.0042 1.0080 1.0160 1.0069 0.9921 1.0091 0.9986 1.0071 0.9990 1.0015 1.0039 1.0097 1.0105 0.9954 0.9943 0.9998
dispcorr: -0.019561487 hartree
energy: -1528.872141933494
dipole: 6.33947 -6.15499 0.18448 -2.15796 2.12523 -0.03274 0.81931 -1.70950 -0.89020
magnitude: 0.90970 au
magnitude: 2.31228 debye
