program: Orca
programVersion: 5.0.2
elementType: S P O O O N C C C C C C C C C C C C C H H H H H H H H H H H H H H H H H H H H H H
charge: 0
multiplicity: 1
keywords: wb97x-d3
keywords: def2-TZVPP
keywords: def2/J RIJCOSX
keywords: DEFGRID2
keywords: scfconv7
keywords: smallprint printgap noloewdin
keywords: NOSOSCF
formula: C13H22NO3PS
InChI: InChI=1/C13H22NO3PS/c1-6-16-18(15,14-10(2)3)17-12-7-8-13(19-5)11(4)9-12/h7-10,14H,6H2,1-5H3
41 atoms
S  -4.619062 -1.089407 -0.230046
P  2.004285 0.773513 0.670212
O  0.70979 1.480081 -0.025402
O  3.106987 1.84317 0.254363
O  1.927855 0.635975 2.139715
N  2.255144 -0.637845 -0.12322
C  2.287721 -1.957462 0.514523
C  3.380828 -2.802189 -0.121056
C  0.930388 -2.642207 0.444071
C  -0.517168 0.852729 -0.019701
C  -2.298332 -0.178921 -1.286166
C  -1.041307 0.408513 -1.224587
C  3.535802 2.084104 -1.093549
C  -1.237206 0.701328 1.15198
C  -3.029289 -0.336833 -0.096408
C  -2.489358 0.104253 1.107116
C  -2.859712 -0.625959 -2.601016
C  4.551794 3.197517 -1.067489
C  -5.225368 -1.100189 1.465593
H  2.544244 -1.800331 1.562792
H  2.167335 -0.651273 -1.131787
H  3.430738 -3.782463 0.354275
H  3.191381 -2.961283 -1.185263
H  4.358074 -2.329499 -0.016923
H  0.164269 -2.05375 0.951078
H  0.966765 -3.622613 0.921968
H  0.615257 -2.788378 -0.591604
H  -0.46849 0.536317 -2.135786
H  3.974828 1.17214 -1.507136
H  2.680878 2.360131 -1.716028
H  -0.844523 1.055909 2.095672
H  -3.035326 -0.003282 2.033931
H  -2.162458 -0.429971 -3.413982
H  -3.080941 -1.695999 -2.604944
H  -3.7928 -0.107225 -2.835028
H  4.122483 4.118527 -0.67166
H  5.420793 2.93116 -0.465064
H  4.896549 3.39816 -2.082083
H  -5.333463 -0.094676 1.86974
H  -4.597962 -1.700738 2.122568
H  -6.213295 -1.557795 1.427388
elementType: S P O N C H
totalener: -1528.85485829 hartree
nucrepener: 1829.94728610 hartree
electener: -3358.80214439 hartree
oneelecener: -5735.81615277 hartree
twoeener: 2377.01400837 hartree
cpcmener: -0.03466330 hartree
kineticenergy: 1523.68561286 hartree
xcener: -113.002032253309 hartree
chargesum: -0.0000000
charge: -0.072702 0.852346 -0.367207 -0.355302 -0.637470 -0.268466 0.127874 -0.265473 -0.283275 0.224730 0.027610 -0.186366 0.034712 -0.205376 -0.019016 -0.159025 -0.229301 -0.245286 -0.274859 0.060945 0.159380 0.086975 0.087329 0.091483 0.088643 0.097880 0.087143 0.128872 0.090706 0.103049 0.142687 0.142605 0.093934 0.101637 0.102731 0.088599 0.087529 0.085526 0.120878 0.120973 0.132348
qa: -0.0727 0.8523 -0.3672 -0.3553 -0.6375 -0.2685 0.1279 -0.2655 -0.2833 0.2247 0.0276 -0.1864 0.0347 -0.2054 -0.0190 -0.1590 -0.2293 -0.2453 -0.2749 0.0609 0.1594 0.0870 0.0873 0.0915 0.0886 0.0979 0.0871 0.1289 0.0907 0.1030 0.1427 0.1426 0.0939 0.1016 0.1027 0.0886 0.0875 0.0855 0.1209 0.1210 0.1323
va: 2.3827 5.5563 2.0599 2.1023 1.9733 3.0563 3.8476 3.9249 3.9259 3.7526 3.6634 3.9526 3.8595 4.0284 3.9279 3.8744 3.8892 3.9644 3.9904 1.0268 1.0212 1.0060 1.0030 1.0109 1.0086 1.0120 1.0059 1.0106 0.9947 0.9907 1.0189 0.9991 1.0075 1.0005 1.0001 1.0043 1.0043 1.0069 0.9953 0.9951 1.0000
dispcorr: -0.019497832 hartree
energy: -1528.874356127044
dipole: 6.99301 -7.14518 -0.15218 -10.36983 9.32197 -1.04785 -7.69759 5.50523 -2.19236
magnitude: 2.43467 au
magnitude: 6.18844 debye
