program: Orca
programVersion: 5.0.2
elementType: S P O O O N C C C C C C C C C C C C C H H H H H H H H H H H H H H H H H H H H H H
charge: 0
multiplicity: 1
keywords: wb97x-d3
keywords: def2-TZVPP
keywords: def2/J RIJCOSX
keywords: DEFGRID2
keywords: scfconv7
keywords: smallprint printgap noloewdin
keywords: NOSOSCF
formula: C13H22NO3PS
InChI: InChI=1/C13H22NO3PS/c1-6-16-18(15,14-10(2)3)17-12-7-8-13(19-5)11(4)9-12/h7-10,14H,6H2,1-5H3
41 atoms
S  -4.611517 -1.107629 -0.185018
P  1.972233 0.802235 0.635988
O  0.708661 1.484057 -0.137996
O  3.092858 1.860304 0.23849
O  1.824984 0.707141 2.103281
N  2.26335 -0.632414 -0.101193
C  2.266481 -1.932015 0.577585
C  3.349938 -2.813156 -0.024262
C  0.899159 -2.597362 0.515678
C  -0.522893 0.866732 -0.105816
C  -2.243658 -0.364394 -1.271735
C  -0.989346 0.232213 -1.247147
C  3.582426 2.056685 -1.096502
C  -1.298765 0.906777 1.038351
C  -3.030107 -0.33048 -0.107471
C  -2.54958 0.307452 1.031345
C  -2.74147 -1.026588 -2.520003
C  4.603406 3.165174 -1.061581
C  -5.278235 -0.867233 1.470422
H  2.517638 -1.747937 1.622868
H  2.212422 -0.678359 -1.111269
H  3.377888 -3.780462 0.478549
H  3.166453 -2.998864 -1.08523
H  4.334839 -2.355531 0.075024
H  0.136852 -1.9789 0.992027
H  0.914153 -3.559933 1.0298
H  0.594269 -2.777318 -0.517686
H  -0.372023 0.210501 -2.137717
H  4.033451 1.12994 -1.461468
H  2.757464 2.317291 -1.764285
H  -0.947977 1.413375 1.927719
H  -3.140989 0.353108 1.934908
H  -2.00466 -0.963964 -3.319462
H  -2.963498 -2.084113 -2.358027
H  -3.660772 -0.559877 -2.882441
H  4.99023 3.333264 -2.066931
H  4.164019 4.099969 -0.711788
H  5.445746 2.912976 -0.416766
H  -5.419248 0.186206 1.707921
H  -4.662397 -1.342363 2.232675
H  -6.254928 -1.349466 1.472781
elementType: S P O N C H
totalener: -1528.85479734 hartree
nucrepener: 1832.40807850 hartree
electener: -3361.26287584 hartree
oneelecener: -5740.78964213 hartree
twoeener: 2379.52676629 hartree
cpcmener: -0.03508516 hartree
kineticenergy: 1523.69139355 hartree
xcener: -113.002718157252 hartree
chargesum: -0.0000000
charge: -0.072812 0.854893 -0.370672 -0.354816 -0.638050 -0.274117 0.129265 -0.266084 -0.281574 0.240304 0.027850 -0.198341 0.034058 -0.201606 -0.016036 -0.168399 -0.228908 -0.245729 -0.276256 0.060066 0.160346 0.087227 0.087351 0.091969 0.086882 0.099746 0.085764 0.129062 0.091315 0.103386 0.143020 0.144922 0.093451 0.101219 0.103534 0.085677 0.088792 0.087497 0.121221 0.121714 0.132868
qa: -0.0728 0.8549 -0.3707 -0.3548 -0.6381 -0.2741 0.1293 -0.2661 -0.2816 0.2403 0.0279 -0.1983 0.0341 -0.2016 -0.0160 -0.1684 -0.2289 -0.2457 -0.2763 0.0601 0.1603 0.0872 0.0874 0.0920 0.0869 0.0997 0.0858 0.1291 0.0913 0.1034 0.1430 0.1449 0.0935 0.1012 0.1035 0.0857 0.0888 0.0875 0.1212 0.1217 0.1329
va: 2.3827 5.5559 2.0579 2.1030 1.9745 3.0553 3.8517 3.9250 3.9223 3.7305 3.6564 3.9558 3.8581 4.0509 3.9274 3.8865 3.8903 3.9652 3.9895 1.0262 1.0206 1.0059 1.0029 1.0107 1.0093 1.0118 1.0053 1.0104 0.9950 0.9908 1.0160 0.9982 1.0075 1.0008 0.9998 1.0069 1.0043 1.0043 0.9949 0.9950 0.9997
dispcorr: -0.019625098 hartree
energy: -1528.874422442420
dipole: 7.32572 -7.36756 -0.04184 -10.62197 9.56786 -1.05411 -6.98877 4.84671 -2.14207
magnitude: 2.38775 au
magnitude: 6.06918 debye
