program: Orca
programVersion: 5.0.2
elementType: S P O O O N C C C C C C C C C C C C C H H H H H H H H H H H H H H H H H H H H H H
charge: 0
multiplicity: 1
keywords: wb97x-d3
keywords: def2-TZVPP
keywords: def2/J RIJCOSX
keywords: DEFGRID2
keywords: scfconv7
keywords: smallprint printgap noloewdin
keywords: NOSOSCF
formula: C13H22NO3PS
InChI: InChI=1/C13H22NO3PS/c1-6-16-18(15,14-10(2)3)17-12-7-8-13(19-5)11(4)9-12/h7-10,14H,6H2,1-5H3
41 atoms
S  -5.070288 0.40632 -0.065032
P  1.992146 0.162303 0.564805
O  0.726987 -0.75384 0.130092
O  2.123142 1.035073 -0.76885
O  1.816248 0.913711 1.827614
N  3.262742 -0.863502 0.583918
C  3.656987 -1.761914 -0.503584
C  3.156011 -3.178121 -0.260001
C  5.168104 -1.723884 -0.670228
C  -0.592038 -0.380644 0.092467
C  -2.870818 -1.176185 -0.100049
C  -1.506419 -1.417209 -0.045782
C  3.090437 2.10174 -0.826615
C  -1.039216 0.926468 0.177408
C  -3.326935 0.149395 -0.004399
C  -2.404372 1.178906 0.127966
C  -3.82985 -2.316122 -0.255915
C  2.478374 3.424729 -0.435313
C  -5.237787 2.18241 0.166414
H  3.202143 -1.383116 -1.421399
H  3.58287 -1.141126 1.50363
H  2.070532 -3.207991 -0.164143
H  3.435237 -3.834364 -1.085543
H  3.587776 -3.593024 0.653774
H  5.517155 -0.715068 -0.893063
H  5.482994 -2.376664 -1.485354
H  5.671541 -2.062531 0.238412
H  -1.14436 -2.436569 -0.113698
H  3.955483 1.870829 -0.198982
H  3.439714 2.126178 -1.858542
H  -0.365458 1.765777 0.279515
H  -2.726686 2.208404 0.197555
H  -4.527169 -2.374431 0.583147
H  -4.430375 -2.216198 -1.16334
H  -3.303113 -3.267472 -0.313775
H  1.617251 3.666237 -1.05909
H  2.167505 3.434826 0.608971
H  3.217399 4.215964 -0.569402
H  -4.832556 2.510739 1.122654
H  -6.307899 2.386454 0.163397
H  -4.782572 2.749624 -0.64429
elementType: S P O N C H
totalener: -1528.85542282 hartree
nucrepener: 1806.05375594 hartree
electener: -3334.90917877 hartree
oneelecener: -5688.48728427 hartree
twoeener: 2353.57810550 hartree
cpcmener: -0.03024152 hartree
kineticenergy: 1523.70056960 hartree
xcener: -113.005383617411 hartree
chargesum: 0.0000000
charge: -0.075717 0.785648 -0.322816 -0.354871 -0.622507 -0.262186 0.112671 -0.272059 -0.266292 0.255320 0.027160 -0.178437 0.057158 -0.187469 -0.034679 -0.199283 -0.229764 -0.259125 -0.276438 0.069921 0.160144 0.090363 0.089463 0.086505 0.091413 0.088825 0.088636 0.135505 0.086384 0.102963 0.128006 0.143116 0.101606 0.101120 0.093147 0.087743 0.084000 0.101788 0.120897 0.132102 0.120040
qa: -0.0757 0.7856 -0.3228 -0.3549 -0.6225 -0.2622 0.1127 -0.2721 -0.2663 0.2553 0.0272 -0.1784 0.0572 -0.1875 -0.0347 -0.1993 -0.2298 -0.2591 -0.2764 0.0699 0.1601 0.0904 0.0895 0.0865 0.0914 0.0888 0.0886 0.1355 0.0864 0.1030 0.1280 0.1431 0.1016 0.1011 0.0931 0.0877 0.0840 0.1018 0.1209 0.1321 0.1200
va: 2.3796 5.6199 2.1256 2.0357 1.9751 3.0881 3.8386 3.9441 3.9395 3.8048 3.7077 3.9216 3.8433 3.9903 3.9354 3.9728 3.8915 3.9323 3.9924 1.0205 1.0230 1.0119 1.0068 1.0042 1.0071 1.0055 1.0039 1.0076 1.0069 0.9919 1.0138 1.0002 1.0007 0.9992 1.0077 1.0028 1.0189 1.0100 0.9956 1.0001 0.9943
dispcorr: -0.018665623 hartree
energy: -1528.874088445507
dipole: 12.40709 -11.25322 1.15387 -1.68021 1.55966 -0.12055 -6.17537 4.94299 -1.23238
magnitude: 1.69255 au
magnitude: 4.30211 debye
