program: Gaussian 09
title: 000065688
version: EM64L-G09RevD.01
frameworkgroup: C1[X(C21H28O8)]
method: RPBEPBE
basis: SDD
operation: Freq
keyword: #pfreq=noraman
keyword: PBEPBE/SDD
title: #p freq=noraman PBEPBE/SDD
converged: YES YES NO NO
title: Mulliken charges:
elementType: O O O O O O O O C C C C C C C C C C C C C C C C C C C C C H H H H H H H H H H H H H H H H H H H H H H H H H H H H
charge: -0.287819 -0.274065 -0.226274 -0.271008 -0.273490 -0.243012 -0.206241 -0.229748 0.308728 -0.342321 -0.461462 -0.165883 0.307316 -0.005596 -0.423754 0.163766 -0.227144 0.278535 0.285439 -0.519361 -0.526410 -0.035653 0.262815 -0.036616 -0.702557 -0.699567 -0.751088 -0.703625 -0.696283 0.303299 0.238351 0.234507 0.279659 0.280104 0.291041 0.309536 0.234672 0.237200 0.243982 0.242521 0.231034 0.229941 0.220247 0.212750 0.205892 0.236254 0.215520 0.199143 0.255565 0.249153 0.254008 0.222062 0.212134 0.206304 0.243108 0.213895 0.200496
chargesum: 0.00000
title: Mulliken charges with hydrogens summed into heavy atoms:
elementType: O O O O O O O O C C C C C C C C C C C C C C C C C C C C C
charge: -0.287819 -0.274065 -0.226274 -0.271008 -0.273490 -0.243012 -0.206241 -0.229748 0.308728 -0.039022 0.011396 0.113776 0.307316 0.274508 -0.132713 0.163766 0.082392 0.278535 0.285439 -0.047488 -0.039907 0.195381 0.262815 0.193325 -0.063669 -0.048651 0.007638 -0.063125 -0.038783
polarizability: 3.30270026e+02 5.46249228e-01 2.84507166e+02 1.09249399e+01 3.87478885e+00 1.82428295e+02
1716.lowfreq: -6.6503 -2.5940 -0.0007 -0.0003 0.0009 4.4235 11.4849 16.2961 19.7505
frequency: 9.9566 16.1153 19.6831 22.7827 30.7097 34.6552 36.3416 41.6639 47.2350 62.0652 68.4978 76.5591 91.7185 100.5620 115.0858 125.6886 134.3966 170.8120 179.3447 189.8130 199.3248 207.5024 213.0251 217.3478 219.9811 240.0087 250.5257 257.2397 274.1923 298.6274 319.1998 326.7174 329.8862 335.3353 348.7745 354.7701 388.2410 398.6174 413.8182 418.6326 453.7724 473.1308 488.3590 517.9552 533.3883 553.5395 558.6553 565.8127 570.7813 593.3900 618.1429 677.6275 682.5307 689.7867 707.3184 756.2554 798.6719 820.5327 824.3339 830.6251 836.7020 848.8518 865.7604 874.8839 876.6075 878.3043 884.9385 887.8594 907.9168 918.3361 920.2920 921.9957 937.1918 956.3080 958.8971 965.6860 970.5572 994.6022 1001.1926 1009.9011 1039.5775 1050.2331 1054.2949 1071.2297 1080.9411 1107.4114 1115.8110 1118.7151 1128.3727 1144.7262 1151.2986 1155.4997 1181.8214 1182.5153 1183.4417 1208.7870 1217.9284 1222.6489 1225.3012 1225.9881 1233.0074 1265.1656 1276.1790 1281.5695 1281.9871 1298.7813 1303.3616 1330.9928 1331.6028 1345.4316 1348.4785 1357.1095 1375.6901 1378.5105 1380.7328 1386.0035 1396.3452 1396.9128 1398.6111 1436.1222 1437.4002 1452.6675 1454.2097 1465.3930 1467.6066 1472.6007 1472.9799 1476.4490 1483.0897 1483.4291 1488.7933 1489.8772 1557.5998 1634.4685 1644.0272 1656.7596 1679.1149 2968.2674 2968.8279 2972.5072 2974.4212 2977.3824 2981.0190 2994.8346 2998.6660 2999.8489 3008.4648 3051.3358 3052.8392 3053.6794 3056.8195 3060.4047 3061.5094 3069.7581 3071.1329 3074.1191 3075.6789 3076.6982 3079.4493 3082.9138 3097.4219 3144.6900 3185.0226 3209.7815 3237.9423
redmass: 2.8480 4.5206 4.1748 4.7679 5.8184 3.7471 4.0591 4.3110 6.4164 2.0955 1.5644 3.5893 4.4292 4.2582 4.3940 5.0073 4.8602 4.5077 5.5539 4.2642 2.6528 1.3935 1.0678 4.5160 5.3188 1.1307 1.2300 2.7374 4.3094 4.5948 4.5917 2.8535 4.7882 3.5658 2.9373 2.9719 2.6942 3.0136 2.2204 2.2293 5.5398 5.0510 4.4593 5.0773 4.3740 3.6236 3.7119 3.8989 4.3773 5.5155 4.9101 6.1801 4.9254 5.5810 7.2736 5.7147 3.8086 4.0476 2.9701 3.3167 5.2970 5.7398 3.7064 1.8741 1.7578 1.5985 1.9774 1.8710 4.0518 2.6182 1.2715 1.1785 2.7940 1.6706 1.5238 1.8017 1.9821 1.9708 2.8335 1.9765 1.6267 1.6834 2.2512 3.0607 2.1364 3.9901 2.0604 2.0600 1.2990 2.8990 2.3986 2.5584 3.5887 1.9259 1.8705 1.8658 1.6504 1.4348 1.3236 1.3854 1.4386 1.6507 1.3934 1.6336 1.4085 1.3989 1.4333 1.5223 1.5039 1.5403 1.5367 1.6759 3.0579 1.2133 1.2108 1.3252 1.7358 1.7620 1.2170 1.0868 1.0888 1.0595 1.0476 1.0494 1.0486 1.0517 1.0513 1.3505 1.0572 1.0566 1.0451 1.0459 7.5065 10.2640 9.0430 9.4297 10.5812 1.0357 1.0361 1.0376 1.0450 1.0556 1.0625 1.0821 1.0837 1.0838 1.0372 1.0862 1.0950 1.0967 1.0861 1.0992 1.0991 1.0988 1.0990 1.0986 1.0985 1.0534 1.0993 1.0996 1.0967 1.1013 1.1193 1.0965 1.0952
irintensity: 0.1507 0.1314 0.4961 0.1043 0.3682 0.3789 1.4795 3.7948 0.1115 1.3916 0.5799 0.3878 0.0508 0.3249 1.8820 2.0547 1.4023 0.1421 4.7482 1.7495 4.2800 0.8967 0.1951 1.9873 7.1678 0.8671 2.1021 11.8465 5.1128 3.9801 7.0342 1.5236 5.7381 5.8460 1.4921 5.3440 2.9090 7.4463 0.7461 1.2509 10.0228 5.5725 0.4033 16.3399 0.5260 11.3136 3.7157 0.9568 1.5643 4.1663 12.0729 17.9663 18.1800 16.4123 2.4268 0.2851 30.1601 22.3812 13.5179 41.8364 68.9948 135.6363 10.1876 78.7899 22.5807 7.5752 36.6625 90.1720 21.8595 85.8483 35.1475 9.2500 24.9786 13.8324 30.3414 0.3504 77.3087 91.9396 306.5817 197.7826 9.5823 176.4420 398.9661 30.6404 193.2477 148.3312 2.4290 60.9375 4.7083 37.3025 42.6904 163.1557 353.5931 37.2923 8.3476 24.1881 6.0391 2.6986 0.5096 5.0101 2.3388 27.6029 40.1574 49.8852 40.9672 7.4095 0.5524 12.4334 6.3405 39.7995 38.5064 13.2793 24.8237 19.6906 20.5166 36.1852 6.3919 11.5203 10.2813 16.3818 15.7795 23.2426 19.6290 3.5391 2.7949 8.5473 9.6196 5.5931 6.8951 6.9684 26.3191 26.6684 35.5521 171.2309 170.1811 88.6307 148.5859 37.4970 34.8170 29.0104 34.8494 4.7917 9.4153 2.1007 4.5620 3.4391 1.3418 6.7335 1.2840 0.7516 5.7194 18.1356 25.6019 43.9069 34.5403 65.5445 69.1165 19.5620 58.2569 45.7526 6.0157 9.2987 13.4220 3.2470 12.7497
temp: 298.150 k
press: 1.00000 atm
elementType: 8 8 8 8 8 8 8 8 6 6 6 6 6 6 6 6 6 6 6 6 6 6 6 6 6 6 6 6 6 1 1 1 1 1 1 1 1 1 1 1 1 1 1 1 1 1 1 1 1 1 1 1 1 1 1 1 1
symmnumber: 1
zpe: 1194996.9 jmol-1
zpe.correction: 0.455150 hartree
zpe.thermalcorrener: 0.486926 hartree
zpe.thermalcorrenthalpy: 0.487870 hartree
zpe.thermalcorrgfe: 0.386009 hartree
zpe.sumelectzpe: -1416.548754 hartree
zpe.sumelectthermal: -1416.516978 hartree
zpe.sumelectthermalent: -1416.516034 hartree
zpe.sumelectthermalfe: -1416.617895 hartree
dipole: -2.1734 -2.3259 3.0025
dipole: 4.3759
quadrupole: -167.0023 -156.9275 -179.8118
quadrupole: -15.6452 -2.1043 -7.6094
quadrupole: 0.9116 10.9863 -11.8979 -15.6452 -2.1043 -7.6094
hfenergy: -1417.0039046 hartree
pointgroup: C01 [X(C21H28O8)]
dipole: 0.8956102 0.9145574 1.1512743 debye
polarizability: 330.1521541|-1.6435184|284.24501|-11.6014245|-6.4378516|182.8083228 unknown
InChI: InChI=1S/C21H28O8/c1-11(2)6-17(23)28-16-8-14-15(27-13(5)22)9-25-20(19(14)21(16)10-26-21)29-18(24)7-12(3)4/h8-9,11-12,16,19-20H,6-7,10H2,1-5H3
charge 0 multiplicity 1
57 atoms
O  -0.333112 1.62961 -1.826621
O  2.726169 0.978598 0.041053
O  -2.417798 -1.417059 0.540868
O  -2.616223 0.903187 0.317504
O  0.521586 -3.74381 0.046334
O  4.49013 0.163952 -1.247961
O  -4.254888 0.559371 -1.326683
O  -1.040036 -5.345927 0.758462
C  0.386028 0.984161 -0.66251
C  -0.390731 -0.05755 0.151546
C  0.122008 2.446116 -0.630863
C  1.761258 0.382964 -0.975027
C  0.357597 -1.351627 -0.180595
C  -1.868907 -0.227612 -0.185033
C  1.564469 -1.098661 -0.772529
C  -0.312479 -2.590024 0.160114
C  -1.637814 -2.576136 0.545428
C  4.086052 0.768887 -0.228022
C  -3.839898 1.216306 -0.356966
C  4.950493 1.342366 0.882575
C  -4.47102 2.440553 0.273104
C  6.342077 1.818427 0.391746
C  0.097328 -5.058463 0.33139
C  -6.006329 2.513905 0.071379
C  7.246218 2.142414 1.602655
C  6.215386 3.037241 -0.552096
C  1.223044 -6.020544 0.030043
C  -6.526275 3.902932 0.506235
C  -6.726603 1.38159 0.840412
H  -0.312192 0.162946 1.234658
H  0.941909 3.142348 -0.839067
H  -0.695626 2.819953 -0.003587
H  2.142806 0.651952 -1.97544
H  -2.0652 -0.377309 -1.262161
H  2.2999 -1.841354 -1.082512
H  -2.198157 -3.446771 0.880619
H  4.402129 2.160169 1.384632
H  5.078134 0.538325 1.636874
H  -4.206001 2.467486 1.345889
H  -3.98978 3.32619 -0.192479
H  6.794374 0.984887 -0.180826
H  -6.207939 2.379335 -1.009602
H  8.247533 2.46897 1.26733
H  7.378448 1.260936 2.257971
H  6.813779 2.958715 2.21308
H  5.599414 2.798872 -1.437921
H  7.2100 3.357359 -0.912713
H  5.754247 3.896038 -0.026306
H  1.410784 -6.050948 -1.058014
H  0.949771 -7.0260 0.380626
H  2.15582 -5.688706 0.515643
H  -7.618138 3.976644 0.352117
H  -6.047123 4.716489 -0.070585
H  -6.326612 4.082395 1.580483
H  -6.384199 0.385587 0.507809
H  -7.818321 1.43372 0.676283
H  -6.543888 1.466504 1.929256
