program: Orca
programVersion: 5.0.2
elementType: S P O O O N C C C C C C C C C C C C C H H H H H H H H H H H H H H H H H H H H H H
charge: 0
multiplicity: 1
keywords: wb97x-d3
keywords: def2-TZVPP
keywords: def2/J RIJCOSX
keywords: DEFGRID2
keywords: scfconv7
keywords: smallprint printgap noloewdin
keywords: NOSOSCF
formula: C13H22NO3PS
InChI: InChI=1/C13H22NO3PS/c1-6-16-18(15,14-10(2)3)17-12-7-8-13(19-5)11(4)9-12/h7-10,14H,6H2,1-5H3
41 atoms
S  -4.773724 -1.087898 -0.031911
P  1.955259 0.813365 0.617499
O  0.62887 1.319747 -0.16535
O  2.962211 1.694834 -0.259466
O  1.991409 1.070752 2.076429
N  2.103559 -0.771288 0.243496
C  2.132396 -1.344695 -1.101583
C  1.178219 -2.526427 -1.181254
C  3.546689 -1.738793 -1.50022
C  -0.60358 0.72088 -0.108376
C  -2.330584 -0.545516 1.00856
C  -1.05737 0.01245 0.995928
C  4.148196 2.264285 0.321602
C  -1.42104 0.88315 -1.212696
C  -3.16304 -0.372728 -0.108353
C  -2.696511 0.341597 -1.206959
C  -2.797368 -1.310289 2.209348
C  5.200842 1.236459 0.662115
C  -5.571066 -0.485181 -1.528561
H  1.780463 -0.576235 -1.794106
H  2.399043 -1.383348 0.992376
H  1.173128 -2.948497 -2.187042
H  1.47753 -3.31878 -0.491232
H  0.157742 -2.230239 -0.935841
H  4.21738 -0.879145 -1.485083
H  3.562245 -2.15588 -2.508269
H  3.949159 -2.494223 -0.821476
H  -0.437264 -0.102786 1.876204
H  4.523429 2.95625 -0.431427
H  3.881088 2.85182 1.202179
H  -1.06957 1.435494 -2.075067
H  -3.316038 0.486891 -2.080901
H  -2.031093 -1.333208 2.982749
H  -3.69544 -0.867319 2.646386
H  -3.041774 -2.3455 1.959202
H  5.487725 0.648073 -0.209708
H  6.092513 1.751298 1.02294
H  4.876849 0.555748 1.45061
H  -5.604093 0.603141 -1.560888
H  -6.594937 -0.855601 -1.493548
H  -5.102747 -0.870011 -2.433163
elementType: S P O N C H
totalener: -1528.85369977 hartree
nucrepener: 1837.15278096 hartree
electener: -3366.00648072 hartree
oneelecener: -5750.46044116 hartree
twoeener: 2384.45396044 hartree
cpcmener: -0.02995322 hartree
kineticenergy: 1523.69884911 hartree
xcener: -113.008208225209 hartree
chargesum: 0.0000000
charge: -0.073916 0.805992 -0.337694 -0.366259 -0.630440 -0.239579 0.117322 -0.267699 -0.277499 0.248892 0.036176 -0.177771 0.048827 -0.235327 -0.059943 -0.138027 -0.231768 -0.276600 -0.276777 0.069431 0.162007 0.091162 0.090721 0.086828 0.087877 0.093645 0.090403 0.115109 0.102014 0.094501 0.144245 0.145117 0.093112 0.101270 0.102186 0.092453 0.104839 0.091040 0.121957 0.132647 0.119526
qa: -0.0739 0.8060 -0.3377 -0.3663 -0.6304 -0.2396 0.1173 -0.2677 -0.2775 0.2489 0.0362 -0.1778 0.0488 -0.2353 -0.0599 -0.1380 -0.2318 -0.2766 -0.2768 0.0694 0.1620 0.0912 0.0907 0.0868 0.0879 0.0936 0.0904 0.1151 0.1020 0.0945 0.1442 0.1451 0.0931 0.1013 0.1022 0.0925 0.1048 0.0910 0.1220 0.1326 0.1195
va: 2.3806 5.5458 2.1277 2.0532 1.9520 3.0190 3.8278 3.9340 3.9462 3.7541 3.6857 3.8571 3.8517 4.0364 3.9645 3.8575 3.8978 3.9177 3.9895 1.0165 1.0227 1.0073 1.0042 1.0052 1.0109 1.0084 1.0038 1.0474 0.9916 1.0051 1.0082 0.9957 1.0091 1.0023 0.9974 0.9991 1.0101 1.0117 0.9962 0.9995 0.9938
dispcorr: -0.020219710 hartree
energy: -1528.873919475634
dipole: 10.52756 -10.01123 0.51633 -10.98120 9.90644 -1.07477 -7.05835 5.26277 -1.79558
magnitude: 2.15542 au
magnitude: 5.47864 debye
