program: Orca
programVersion: 5.0.2
elementType: S P O O O N C C C C C C C C C C C C C H H H H H H H H H H H H H H H H H H H H H H
charge: 0
multiplicity: 1
keywords: wb97x-d3
keywords: def2-TZVPP
keywords: def2/J RIJCOSX
keywords: DEFGRID2
keywords: scfconv7
keywords: smallprint printgap noloewdin
keywords: NOSOSCF
formula: C13H22NO3PS
InChI: InChI=1/C13H22NO3PS/c1-6-16-18(15,14-10(2)3)17-12-7-8-13(19-5)11(4)9-12/h7-10,14H,6H2,1-5H3
41 atoms
S  -4.634648 -0.256624 -0.894188
P  2.089346 0.46006 0.675281
O  0.72636 0.324022 1.548451
O  1.678018 1.699002 -0.243774
O  3.235441 0.624545 1.59444
N  2.266742 -0.793699 -0.369639
C  3.071689 -1.982659 -0.077268
C  3.533336 -2.591893 -1.390585
C  2.325867 -2.994319 0.781142
C  -0.518124 0.214993 0.96523
C  -2.282911 -1.17775 0.079886
C  -1.020764 -1.036708 0.643448
C  2.623425 2.271068 -1.166825
C  -1.275788 1.349585 0.741197
C  -3.0475 -0.024598 -0.162052
C  -2.538019 1.224532 0.180389
C  -2.806496 -2.539452 -0.259637
C  3.369441 3.424174 -0.540926
C  -5.276247 1.417641 -1.052072
H  3.952773 -1.643776 0.470294
H  1.544445 -0.929632 -1.067434
H  4.17923 -3.45101 -1.207636
H  2.684633 -2.93798 -1.985881
H  4.093462 -1.870266 -1.986378
H  1.430167 -3.357521 0.272457
H  2.023566 -2.560447 1.735556
H  2.957762 -3.857202 0.997894
H  -0.427981 -1.920991 0.843877
H  3.314888 1.505925 -1.528834
H  2.035659 2.607249 -2.020828
H  -0.895745 2.32806 1.004671
H  -3.112182 2.124759 0.011687
H  -2.08441 -3.312937 -0.001817
H  -3.732475 -2.761663 0.276301
H  -3.025253 -2.634452 -1.32604
H  4.024991 3.876586 -1.286041
H  2.685752 4.195945 -0.186089
H  3.989638 3.099811 0.294653
H  -4.662566 2.032675 -1.708724
H  -5.393415 1.906031 -0.085709
H  -6.262847 1.318862 -1.503553
elementType: S P O N C H
totalener: -1528.85447848 hartree
nucrepener: 1832.99503274 hartree
electener: -3361.84951122 hartree
oneelecener: -5741.71707621 hartree
twoeener: 2379.86756499 hartree
cpcmener: -0.03300313 hartree
kineticenergy: 1523.69974190 hartree
xcener: -113.004012522624 hartree
chargesum: -0.0000000
charge: -0.071615 0.834679 -0.364583 -0.350211 -0.639286 -0.268986 0.128406 -0.269586 -0.300508 0.235049 0.016611 -0.196679 0.043252 -0.220378 -0.014264 -0.159367 -0.239778 -0.247208 -0.275457 0.063907 0.163716 0.089085 0.088100 0.093808 0.080126 0.097712 0.103241 0.171853 0.086990 0.101934 0.143199 0.143603 0.093124 0.102563 0.101789 0.092601 0.087160 0.080906 0.121149 0.120836 0.132511
qa: -0.0716 0.8347 -0.3646 -0.3502 -0.6393 -0.2690 0.1284 -0.2696 -0.3005 0.2350 0.0166 -0.1967 0.0433 -0.2204 -0.0143 -0.1594 -0.2398 -0.2472 -0.2755 0.0639 0.1637 0.0891 0.0881 0.0938 0.0801 0.0977 0.1032 0.1719 0.0870 0.1019 0.1432 0.1436 0.0931 0.1026 0.1018 0.0926 0.0872 0.0809 0.1211 0.1208 0.1325
va: 2.3845 5.5584 2.0789 2.0760 1.9761 3.0639 3.8402 3.9303 3.9173 3.7907 3.6923 3.9419 3.8727 4.0494 3.9384 3.8584 3.8997 3.9358 3.9903 1.0253 1.0210 1.0056 1.0027 1.0086 1.0037 1.0099 1.0110 0.9753 1.0068 0.9920 1.0103 0.9977 1.0080 0.9997 0.9999 1.0087 1.0036 1.0184 0.9951 0.9947 0.9999
dispcorr: -0.019384774 hartree
energy: -1528.873863256544
dipole: 7.01867 -8.10314 -1.08447 -6.32919 6.07579 -0.25341 -10.44600 7.99998 -2.44602
magnitude: 2.68762 au
magnitude: 6.83138 debye
