program: Orca
programVersion: 5.0.2
elementType: S P O O O N C C C C C C C C C C C C C H H H H H H H H H H H H H H H H H H H H H H
charge: 0
multiplicity: 1
keywords: wb97x-d3
keywords: def2-TZVPP
keywords: def2/J RIJCOSX
keywords: DEFGRID2
keywords: scfconv7
keywords: smallprint printgap noloewdin
keywords: NOSOSCF
formula: C13H22NO3PS
InChI: InChI=1/C13H22NO3PS/c1-6-16-18(15,14-10(2)3)17-12-7-8-13(19-5)11(4)9-12/h7-10,14H,6H2,1-5H3
41 atoms
S  -4.770207 0.618775 -0.360352
P  2.081225 0.139181 0.882177
O  0.795801 -0.844828 1.018502
O  1.73846 0.770332 -0.54736
O  2.262103 1.10506 1.991005
N  3.311913 -0.920414 0.736664
C  3.50382 -1.871405 -0.356491
C  3.884727 -3.230968 0.208125
C  4.536899 -1.362949 -1.352047
C  -0.486653 -0.43901 0.727721
C  -2.582352 -0.978864 -0.348689
C  -1.271245 -1.299905 -0.024587
C  2.101496 2.106582 -0.930967
C  -1.00513 0.764099 1.173761
C  -3.106703 0.248129 0.092142
C  -2.311368 1.101428 0.848358
C  -3.408311 -1.922521 -1.167608
C  1.085177 2.604949 -1.927165
C  -5.018879 2.281241 0.281093
H  2.546454 -1.975189 -0.87286
H  4.115313 -0.75189 1.327162
H  4.832855 -3.179326 0.749188
H  3.122487 -3.599667 0.895288
H  3.999712 -3.963005 -0.592449
H  4.654486 -2.061754 -2.181784
H  5.513076 -1.244037 -0.876261
H  4.244616 -0.397715 -1.767751
H  -0.851586 -2.238321 -0.368101
H  2.128494 2.756771 -0.054451
H  3.103525 2.08879 -1.366469
H  -0.417451 1.443152 1.777722
H  -2.692546 2.0495 1.201581
H  -4.3072 -2.241459 -0.634191
H  -3.737812 -1.461586 -2.101985
H  -2.843915 -2.818244 -1.423507
H  0.085984 2.642184 -1.490326
H  1.351357 3.615222 -2.24039
H  1.051687 1.978017 -2.819025
H  -4.322361 2.995714 -0.155639
H  -4.958921 2.31934 1.367812
H  -6.028138 2.567852 -0.012472
elementType: S P O N C H
totalener: -1528.85491093 hartree
nucrepener: 1827.35767429 hartree
electener: -3356.21258523 hartree
oneelecener: -5730.98828497 hartree
twoeener: 2374.77569975 hartree
cpcmener: -0.02973178 hartree
kineticenergy: 1523.69429107 hartree
xcener: -113.004204199316 hartree
chargesum: -0.0000000
charge: -0.074276 0.802393 -0.355268 -0.350708 -0.633300 -0.249411 0.105291 -0.261707 -0.270525 0.247840 0.025844 -0.174058 0.052649 -0.236693 -0.028266 -0.150773 -0.228545 -0.245493 -0.275653 0.065648 0.160249 0.087728 0.091612 0.087708 0.089731 0.088550 0.087657 0.129730 0.099486 0.097158 0.138869 0.143433 0.102067 0.101641 0.093630 0.082978 0.091062 0.088018 0.121135 0.120414 0.132156
qa: -0.0743 0.8024 -0.3553 -0.3507 -0.6333 -0.2494 0.1053 -0.2617 -0.2705 0.2478 0.0258 -0.1741 0.0526 -0.2367 -0.0283 -0.1508 -0.2285 -0.2455 -0.2757 0.0656 0.1602 0.0877 0.0916 0.0877 0.0897 0.0885 0.0877 0.1297 0.0995 0.0972 0.1389 0.1434 0.1021 0.1016 0.0936 0.0830 0.0911 0.0880 0.1211 0.1204 0.1322
va: 2.3815 5.5887 2.0819 2.0200 1.9688 3.0932 3.8581 3.9337 3.9486 3.7390 3.6915 3.9870 3.8227 3.9677 3.9280 3.8598 3.8892 3.9439 3.9908 1.0150 1.0229 1.0038 1.0113 1.0059 1.0070 1.0040 1.0080 1.0102 1.0095 0.9907 1.0322 0.9994 0.9985 1.0013 1.0075 1.0043 1.0092 1.0034 0.9958 0.9946 0.9999
dispcorr: -0.019049808 hartree
energy: -1528.873960742664
dipole: 8.54122 -8.02232 0.51890 -1.66280 1.73143 0.06863 -12.98618 11.32126 -1.66491
magnitude: 1.74525 au
magnitude: 4.43608 debye
