program: Orca
programVersion: 5.0.2
elementType: S P O O O N C C C C C C C C C C C C C H H H H H H H H H H H H H H H H H H H H H H
charge: 0
multiplicity: 1
keywords: wb97x-d3
keywords: def2-TZVPP
keywords: def2/J RIJCOSX
keywords: DEFGRID2
keywords: scfconv7
keywords: smallprint printgap noloewdin
keywords: NOSOSCF
formula: C13H22NO3PS
InChI: InChI=1/C13H22NO3PS/c1-6-16-18(15,14-10(2)3)17-12-7-8-13(19-5)11(4)9-12/h7-10,14H,6H2,1-5H3
41 atoms
S  -4.3220 -0.753249 -0.684315
P  2.355104 0.414951 0.749695
O  0.953549 0.995288 1.349345
O  2.504788 1.184695 -0.64486
O  3.420901 0.648262 1.748519
N  2.117592 -1.151454 0.333165
C  1.522522 -1.682093 -0.896994
C  0.773465 -2.966093 -0.5766
C  2.573324 -1.911003 -1.974605
C  -0.271413 0.618462 0.845774
C  -2.183118 -0.854433 0.971807
C  -0.942485 -0.441048 1.437343
C  3.176294 2.454792 -0.745402
C  -0.840444 1.296508 -0.216912
C  -2.7555 -0.176506 -0.117707
C  -2.081924 0.896936 -0.691454
C  -2.875006 -2.017738 1.612683
C  2.424498 3.597237 -0.1046
C  -4.677122 0.301281 -2.098783
H  0.799416 -0.948965 -1.259968
H  2.72183 -1.797832 0.825092
H  1.453713 -3.732128 -0.196175
H  -0.002946 -2.801138 0.170533
H  0.296921 -3.363812 -1.473267
H  3.097898 -0.989361 -2.225715
H  2.112853 -2.29176 -2.887607
H  3.314425 -2.642946 -1.645477
H  -0.488831 -0.959343 2.27372
H  4.179115 2.368163 -0.322525
H  3.285007 2.626261 -1.815507
H  -0.335616 2.13606 -0.676539
H  -2.508683 1.43964 -1.523369
H  -2.293107 -2.407289 2.44663
H  -3.86001 -1.743863 1.998084
H  -3.025822 -2.836246 0.904461
H  2.956013 4.525227 -0.32062
H  1.414818 3.69494 -0.503847
H  2.364884 3.5027 0.9798
H  -4.782653 1.348025 -1.817599
H  -5.63275 -0.041274 -2.493978
H  -3.929004 0.200045 -2.88384
elementType: S P O N C H
totalener: -1528.85077946 hartree
nucrepener: 1875.72991148 hartree
electener: -3404.58069095 hartree
oneelecener: -5827.22996667 hartree
twoeener: 2422.64927572 hartree
cpcmener: -0.03127256 hartree
kineticenergy: 1523.69046388 hartree
xcener: -113.006005387075 hartree
chargesum: -0.0000000
charge: -0.071904 0.809667 -0.364548 -0.347006 -0.635792 -0.267003 0.118545 -0.275089 -0.280136 0.231966 -0.023680 -0.147348 0.035216 -0.193719 0.011432 -0.195588 -0.239682 -0.264879 -0.276456 0.072887 0.159416 0.096108 0.090447 0.094171 0.090103 0.089882 0.088536 0.129490 0.096642 0.099883 0.151926 0.141210 0.096791 0.111559 0.103123 0.104772 0.092424 0.091752 0.120337 0.133442 0.121105
qa: -0.0719 0.8097 -0.3645 -0.3470 -0.6358 -0.2670 0.1185 -0.2751 -0.2801 0.2320 -0.0237 -0.1473 0.0352 -0.1937 0.0114 -0.1956 -0.2397 -0.2649 -0.2765 0.0729 0.1594 0.0961 0.0904 0.0942 0.0901 0.0899 0.0885 0.1295 0.0966 0.0999 0.1519 0.1412 0.0968 0.1116 0.1031 0.1048 0.0924 0.0918 0.1203 0.1334 0.1211
va: 2.3849 5.5675 2.0421 2.0521 1.9848 3.0337 3.8398 3.9238 3.9528 3.6957 3.6669 3.9064 3.8536 3.9919 3.8976 3.9378 3.8825 3.9100 3.9911 1.0045 1.0241 1.0044 1.0074 1.0056 1.0135 1.0061 1.0049 1.0119 1.0051 0.9915 0.9984 1.0020 1.0069 0.9999 0.9998 1.0099 0.9994 1.0136 0.9947 0.9995 0.9956
dispcorr: -0.021735791 hartree
energy: -1528.872515252501
dipole: -0.88342 -0.25788 -1.14130 -4.89700 4.58255 -0.31445 -12.41736 10.06645 -2.35091
magnitude: 2.63215 au
magnitude: 6.69039 debye
