program: Orca
programVersion: 5.0.2
elementType: S P O O O N C C C C C C C C C C C C C H H H H H H H H H H H H H H H H H H H H H H
charge: 0
multiplicity: 1
keywords: wb97x-d3
keywords: def2-TZVPP
keywords: def2/J RIJCOSX
keywords: DEFGRID2
keywords: scfconv7
keywords: smallprint printgap noloewdin
keywords: NOSOSCF
formula: C13H22NO3PS
InChI: InChI=1/C13H22NO3PS/c1-6-16-18(15,14-10(2)3)17-12-7-8-13(19-5)11(4)9-12/h7-10,14H,6H2,1-5H3
41 atoms
S  -5.135038 0.273687 -0.177806
P  1.936163 0.306714 0.645028
O  0.677879 -0.675556 0.356028
O  1.936224 1.121718 -0.730252
O  1.828125 1.112966 1.881893
N  3.230328 -0.690498 0.621099
C  3.623061 -1.575484 -0.477277
C  3.130232 -2.998794 -0.256704
C  5.134311 -1.530311 -0.642283
C  -0.645835 -0.343395 0.23766
C  -2.870442 -1.213299 -0.160834
C  -1.503459 -1.402469 -0.033123
C  2.556276 2.417213 -0.828709
C  -1.154511 0.935955 0.383099
C  -3.389204 0.084331 -0.012505
C  -2.523542 1.137421 0.253831
C  -3.765124 -2.378712 -0.451612
C  4.06477 2.360161 -0.789976
C  -5.393053 2.030719 0.108527
H  3.167082 -1.184585 -1.38933
H  3.580926 -0.960291 1.532243
H  3.421729 -3.640511 -1.089469
H  3.558685 -3.423156 0.654232
H  2.044611 -3.040909 -0.170462
H  5.451002 -2.164968 -1.470906
H  5.637737 -1.887749 0.259167
H  5.481841 -0.516385 -0.842549
H  -1.092878 -2.39937 -0.144617
H  2.214419 2.819143 -1.781559
H  2.172704 3.06866 -0.040886
H  -0.52657 1.787767 0.605967
H  -2.895541 2.145607 0.371746
H  -4.51023 -2.521615 0.334718
H  -4.311691 -2.244328 -1.388156
H  -3.192904 -3.301519 -0.534778
H  4.443954 2.032147 0.177993
H  4.462759 1.70347 -1.564156
H  4.457281 3.361833 -0.971803
H  -5.075092 2.335874 1.104572
H  -6.467611 2.193222 0.031505
H  -4.902669 2.647177 -0.643567
elementType: S P O N C H
totalener: -1528.85440794 hartree
nucrepener: 1807.48073388 hartree
electener: -3336.33514182 hartree
oneelecener: -5691.25974846 hartree
twoeener: 2354.92460664 hartree
cpcmener: -0.02981402 hartree
kineticenergy: 1523.69458558 hartree
xcener: -113.005665497533 hartree
chargesum: 0.0000000
charge: -0.075636 0.795876 -0.324133 -0.358046 -0.627325 -0.253450 0.104433 -0.271225 -0.265589 0.279293 0.038203 -0.197322 0.051968 -0.211677 -0.047879 -0.181823 -0.229124 -0.269495 -0.275049 0.069634 0.158473 0.089299 0.086086 0.090008 0.089919 0.090101 0.092370 0.136263 0.102546 0.095364 0.124761 0.142400 0.101614 0.100985 0.093206 0.089585 0.088215 0.105387 0.120132 0.131781 0.119874
qa: -0.0756 0.7959 -0.3241 -0.3580 -0.6273 -0.2535 0.1044 -0.2712 -0.2656 0.2793 0.0382 -0.1973 0.0520 -0.2117 -0.0479 -0.1818 -0.2291 -0.2695 -0.2750 0.0696 0.1585 0.0893 0.0861 0.0900 0.0899 0.0901 0.0924 0.1363 0.1025 0.0954 0.1248 0.1424 0.1016 0.1010 0.0932 0.0896 0.0882 0.1054 0.1201 0.1318 0.1199
va: 2.3793 5.5920 2.1314 2.0366 1.9712 3.0796 3.8418 3.9520 3.9304 3.7938 3.7013 3.9359 3.8381 4.0031 3.9438 3.9471 3.8911 3.9276 3.9930 1.0223 1.0243 1.0068 1.0046 1.0119 1.0061 1.0037 1.0059 1.0074 0.9902 1.0048 1.0287 0.9997 1.0001 0.9997 1.0077 1.0120 1.0018 1.0117 0.9954 1.0002 0.9950
dispcorr: -0.019004675 hartree
energy: -1528.873412612072
dipole: 14.82087 -13.86710 0.95377 -3.29401 3.25278 -0.04123 -7.59757 6.29338 -1.30419
magnitude: 1.61626 au
magnitude: 4.10820 debye
