program: Orca
programVersion: 5.0.2
elementType: S P O O O N C C C C C C C C C C C C C H H H H H H H H H H H H H H H H H H H H H H
charge: 0
multiplicity: 1
keywords: wb97x-d3
keywords: def2-TZVPP
keywords: def2/J RIJCOSX
keywords: DEFGRID2
keywords: scfconv7
keywords: smallprint printgap noloewdin
keywords: NOSOSCF
formula: C13H22NO3PS
InChI: InChI=1/C13H22NO3PS/c1-6-16-18(15,14-10(2)3)17-12-7-8-13(19-5)11(4)9-12/h7-10,14H,6H2,1-5H3
41 atoms
S  -4.788988 -0.20181 -0.385965
P  2.171535 0.33664 0.722511
O  0.971081 1.104003 -0.069825
O  3.406922 1.022341 -0.019005
O  2.135859 0.49253 2.194317
N  2.10126 -1.211003 0.211792
C  2.133903 -1.682808 -1.17294
C  1.0304 -2.706918 -1.390453
C  3.503504 -2.247367 -1.523145
C  -0.348076 0.746956 -0.078446
C  -2.29172 -0.371156 0.828165
C  -0.93701 -0.049955 0.89429
C  4.053624 2.20901 0.48017
C  -1.105483 1.25117 -1.125733
C  -3.051405 0.122128 -0.240739
C  -2.450091 0.936344 -1.196171
C  -2.885454 -1.23925 1.894623
C  3.242737 3.462347 0.258876
C  -4.776988 -1.898789 -1.020107
H  1.937059 -0.823959 -1.818899
H  2.312708 -1.909478 0.913107
H  1.026813 -3.056816 -2.423528
H  1.173134 -3.577926 -0.746286
H  0.049155 -2.282566 -1.174648
H  4.285259 -1.497064 -1.399392
H  3.527798 -2.589138 -2.558878
H  3.749325 -3.100745 -0.886765
H  -0.361732 -0.422274 1.732535
H  4.293416 2.079885 1.537512
H  4.994812 2.262357 -0.065447
H  -0.646999 1.882582 -1.876041
H  -3.042916 1.327595 -2.012892
H  -3.87863 -0.898159 2.18524
H  -2.990855 -2.27142 1.552631
H  -2.253873 -1.25725 2.781901
H  3.846748 4.325081 0.543412
H  2.96522 3.582083 -0.788644
H  2.337507 3.483645 0.866385
H  -4.247772 -1.959031 -1.969553
H  -5.814898 -2.189535 -1.182331
H  -4.334299 -2.594539 -0.309495
elementType: S P O N C H
totalener: -1528.85185462 hartree
nucrepener: 1841.76069222 hartree
electener: -3370.61254684 hartree
oneelecener: -5759.47353798 hartree
twoeener: 2388.86099114 hartree
cpcmener: -0.02766654 hartree
kineticenergy: 1523.69610813 hartree
xcener: -113.000460173421 hartree
chargesum: -0.0000000
charge: -0.138131 0.807879 -0.333158 -0.353645 -0.623837 -0.251604 0.110583 -0.267331 -0.268867 0.294492 0.043609 -0.205994 0.032216 -0.229868 -0.055200 -0.092567 -0.233211 -0.246025 -0.271747 0.071157 0.158740 0.091783 0.090059 0.088664 0.089183 0.089023 0.087433 0.114032 0.092783 0.101015 0.144803 0.130063 0.101405 0.106143 0.100066 0.097668 0.086808 0.086149 0.116166 0.124278 0.114984
qa: -0.1381 0.8079 -0.3332 -0.3536 -0.6238 -0.2516 0.1106 -0.2673 -0.2689 0.2945 0.0436 -0.2060 0.0322 -0.2299 -0.0552 -0.0926 -0.2332 -0.2460 -0.2717 0.0712 0.1587 0.0918 0.0901 0.0887 0.0892 0.0890 0.0874 0.1140 0.0928 0.1010 0.1448 0.1301 0.1014 0.1061 0.1001 0.0977 0.0868 0.0861 0.1162 0.1243 0.1150
va: 2.2236 5.5562 2.0978 2.0817 1.9663 3.0580 3.8408 3.9307 3.9450 3.7056 3.6904 3.8913 3.8722 4.0209 3.7742 3.9553 3.8777 3.8970 3.9668 1.0176 1.0235 1.0071 1.0044 1.0044 1.0132 1.0065 1.0039 1.0504 1.0051 0.9894 1.0055 1.0153 1.0140 0.9907 1.0073 1.0091 1.0059 1.0138 0.9995 0.9995 0.9962
dispcorr: -0.020261861 hartree
energy: -1528.872116477437
dipole: 6.04638 -5.21230 0.83409 -11.01853 9.66424 -1.35430 -7.18265 5.63080 -1.55185
magnitude: 2.22217 au
magnitude: 5.64831 debye
