program: Orca
programVersion: 5.0.2
elementType: S P O O O N C C C C C C C C C C C C C H H H H H H H H H H H H H H H H H H H H H H
charge: 0
multiplicity: 1
keywords: wb97x-d3
keywords: def2-TZVPP
keywords: def2/J RIJCOSX
keywords: DEFGRID2
keywords: scfconv7
keywords: smallprint printgap noloewdin
keywords: NOSOSCF
formula: C13H22NO3PS
InChI: InChI=1/C13H22NO3PS/c1-6-16-18(15,14-10(2)3)17-12-7-8-13(19-5)11(4)9-12/h7-10,14H,6H2,1-5H3
41 atoms
S  -4.441044 -1.344339 0.652929
P  2.080359 0.782268 0.06061
O  0.706198 1.22064 -0.722323
O  3.124594 1.528796 -0.885331
O  2.078903 1.116255 1.495659
N  2.328086 -0.801777 -0.278847
C  2.336991 -1.870571 0.716102
C  3.501126 -2.811733 0.440852
C  1.004528 -2.608259 0.753774
C  -0.484881 0.643483 -0.374693
C  -2.342055 -0.750055 -1.055665
C  -1.126925 -0.134131 -1.327384
C  3.234845 2.957913 -0.873507
C  -1.044026 0.824517 0.880931
C  -2.910791 -0.564467 0.210559
C  -2.255739 0.212951 1.158438
C  -3.000756 -1.598493 -2.101732
C  4.23883 3.428076 0.154721
C  -5.620385 -0.125107 0.013079
H  2.498683 -1.392038 1.682706
H  2.319467 -1.098184 -1.24317
H  3.556191 -3.591226 1.2009
H  3.38838 -3.308574 -0.526029
H  4.447743 -2.272596 0.436017
H  0.784224 -3.072628 -0.209894
H  0.185168 -1.930407 0.992371
H  1.018527 -3.397893 1.506171
H  -0.665075 -0.25818 -2.299422
H  3.550471 3.235547 -1.879587
H  2.260271 3.423333 -0.703219
H  -0.541197 1.423757 1.626711
H  -2.704539 0.33756 2.13503
H  -2.373039 -1.6847 -2.987318
H  -3.205553 -2.600907 -1.727938
H  -3.957558 -1.180469 -2.41719
H  4.345682 4.511736 0.093013
H  3.918462 3.174325 1.163699
H  5.218554 2.984478 -0.020214
H  -6.618955 -0.48632 0.254547
H  -5.543432 -0.016838 -1.067045
H  -5.474953 0.843845 0.485576
totalener: -1528.82868400 hartree
nucrepener: 1837.26758565 hartree
electener: -3366.09626965 hartree
oneelecener: -5750.08986985 hartree
twoeener: 2383.99360019 hartree
kineticenergy: 1523.77192950 hartree
xcener: -113.005771893718 hartree
chargesum: -0.0000000
charge: -0.095484 0.807652 -0.352087 -0.344696 -0.534201 -0.238332 0.089206 -0.241399 -0.241685 0.230952 0.053058 -0.204480 0.028160 -0.146806 -0.051271 -0.091389 -0.212781 -0.236915 -0.274910 0.069196 0.116496 0.078807 0.069383 0.098140 0.069103 0.090109 0.086878 0.097265 0.089694 0.081176 0.135523 0.117380 0.079603 0.106193 0.090677 0.078247 0.097058 0.080575 0.115695 0.098625 0.111582
qa: -0.0955 0.8077 -0.3521 -0.3447 -0.5342 -0.2383 0.0892 -0.2414 -0.2417 0.2310 0.0531 -0.2045 0.0282 -0.1468 -0.0513 -0.0914 -0.2128 -0.2369 -0.2749 0.0692 0.1165 0.0788 0.0694 0.0981 0.0691 0.0901 0.0869 0.0973 0.0897 0.0812 0.1355 0.1174 0.0796 0.1062 0.0907 0.0782 0.0971 0.0806 0.1157 0.0986 0.1116
va: 2.2366 5.6009 2.0746 2.1289 2.0635 3.0973 3.8892 3.9322 3.9241 3.8535 3.6577 4.0212 3.9175 3.9750 3.8801 3.9489 3.9220 3.9111 3.9898 1.0262 1.0531 1.0089 1.0059 1.0109 1.0109 1.0150 1.0148 1.0234 0.9920 1.0027 1.0229 1.0183 1.0081 1.0036 0.9968 1.0106 1.0204 1.0058 1.0024 0.9974 0.9987
dispcorr: -0.020194470 hartree
energy: -1528.848878469762
dipole: 4.25141 -4.25577 -0.00436 -6.34673 6.27269 -0.07403 -3.14954 1.98191 -1.16763
magnitude: 1.16999 au
magnitude: 2.97387 debye
