program: Gaussian 09
title: 000065695
version: EM64L-G09RevD.01
frameworkgroup: C1[X(C20H22N4O)]
method: RPBEPBE
basis: SDD
operation: Freq
keyword: #p
keyword: freq=noraman
keyword: PBEPBE/SDD
title: #p freq=noraman PBEPBE/SDD
converged: YES YES NO NO
title: Mulliken charges:
elementType: O N N N N C C C C C C C C C C C C C C C C C C C C H H H H H H H H H H H H H H H H H H H H H H
charge: -0.209396 -0.082139 -0.350197 -0.428024 -0.099203 -0.126284 0.402236 0.174491 -0.733790 0.080065 -0.480453 0.437665 -0.623895 -0.630417 0.355188 -0.434497 -0.381703 -0.366452 -0.374547 -0.212067 -0.203527 -0.248110 -0.234919 -0.245062 -0.241721 0.167821 0.328727 0.263359 0.223454 0.219788 0.301962 0.244176 0.184115 0.224785 0.260890 0.226895 0.181595 0.275131 0.279101 0.230029 0.265778 0.232821 0.234607 0.225161 0.224249 0.235401 0.226914
chargesum: 0.00000
title: Mulliken charges with hydrogens summed into heavy atoms:
elementType: O N N N N C C C C C C C C C C C C C C C C C C C C
charge: -0.209396 -0.082139 -0.350197 -0.099297 -0.099203 0.041537 0.402236 0.174491 -0.027188 0.080065 -0.178492 0.437665 0.029181 0.038962 0.355188 -0.159366 -0.102602 -0.136423 -0.108769 0.020754 0.031080 -0.022949 -0.010670 -0.009661 -0.014807
polarizability: 3.55943250e+02 -3.59779300e+01 3.04960839e+02 2.20045558e+01 1.16190912e+01 1.49235740e+02
1716.lowfreq: -5.2198 0.0009 0.0009 0.0009 0.9199 3.4862 16.2979 25.9498 30.1340
frequency: 16.2463 25.9424 30.1024 39.6994 48.3999 50.3774 61.5305 64.4645 114.4766 120.5063 157.7926 170.8281 192.5093 205.3328 214.8064 223.2950 236.5676 249.2575 266.9345 270.6852 292.2067 321.6675 357.0169 373.5687 402.1722 410.3599 414.4217 426.9103 436.9343 482.7464 491.4204 514.2729 570.9852 610.5342 615.2434 624.3510 647.4576 660.7704 673.2487 686.4745 688.5530 700.0936 702.2984 719.0219 761.9062 768.2948 783.0813 819.5632 847.3894 849.9832 860.2275 895.6227 920.1437 931.5639 936.0438 962.5083 974.1044 982.8083 987.9524 989.1241 995.2464 1000.1180 1007.9162 1022.8474 1033.2763 1035.7795 1038.8241 1053.5478 1069.0408 1082.5907 1087.6367 1092.4211 1094.2275 1116.3535 1132.6080 1158.7855 1171.8433 1173.6056 1183.7430 1190.1768 1210.3610 1223.8464 1240.6917 1261.5407 1300.9952 1306.5825 1317.6981 1344.9958 1351.8361 1375.5035 1382.0537 1383.5199 1390.2884 1419.4101 1432.1077 1444.5781 1445.2374 1447.0969 1462.7475 1465.2518 1471.7467 1475.8274 1481.4945 1485.0523 1491.3756 1511.2550 1517.3857 1565.7597 1587.9951 1595.4031 1611.0034 1618.7321 1630.2685 2742.8692 2837.8689 2854.3867 2998.6186 3032.3288 3038.4792 3087.9089 3090.9519 3098.3676 3114.3045 3123.7625 3130.4037 3132.8441 3139.8432 3146.4023 3151.2155 3156.8704 3166.9688 3167.4213 3182.3206 3271.6611 3496.4385
redmass: 3.3116 3.7706 4.3241 3.3424 3.8078 5.8385 4.1359 4.4744 5.0859 5.6110 4.3879 3.7760 2.2615 1.4949 1.6202 1.2801 2.1156 5.2919 4.4213 4.0978 4.2116 3.4712 2.2968 5.5754 2.8146 2.9513 4.4149 5.0250 2.7888 3.5546 3.0334 3.9819 4.5148 4.6732 6.4286 1.2983 6.0648 6.2089 6.2229 3.4234 3.2437 1.9119 2.5349 4.2067 3.2014 1.8868 1.9170 3.6363 1.3756 1.2401 1.2929 3.9881 1.4020 1.4624 7.4301 2.2258 1.4156 1.3813 4.8047 6.1207 1.3400 1.3280 5.2668 2.4946 1.5501 2.1196 1.6940 2.1603 1.9776 1.6296 1.6005 1.6395 1.9434 2.0434 1.7448 2.1467 1.0563 1.0547 1.1198 1.1317 2.1986 3.2328 3.5830 2.6992 1.3525 1.7355 1.3817 1.6984 2.4657 3.2241 1.4135 6.7713 4.7254 1.1364 2.7018 1.1874 2.2750 2.5306 1.0496 1.0557 1.0493 1.0667 1.0519 2.4036 1.0510 2.6532 4.3235 7.0580 6.2021 6.7213 6.1523 6.0426 6.8292 1.0792 1.0581 1.0581 1.0355 1.0711 1.0718 1.1009 1.0996 1.0992 1.1013 1.0845 1.0859 1.0880 1.0886 1.0930 1.0942 1.0960 1.0983 1.1007 1.0976 1.0985 1.0765
irintensity: 0.1761 0.3433 1.3743 1.2345 1.4454 0.0180 0.2557 1.1245 3.3789 5.5420 0.2840 0.5713 2.8763 0.1027 3.4237 0.2876 1.2500 3.0844 0.3096 3.8524 0.3890 7.9564 2.4604 1.3223 0.0140 1.0511 2.7702 1.2947 0.6862 8.8475 6.9026 5.8624 8.5635 6.1699 0.2109 64.1211 15.4405 14.5147 25.5493 10.4816 23.8562 37.3780 17.7804 3.7360 20.2122 48.1436 64.2372 3.5696 23.6334 2.1341 16.5769 23.5455 7.1628 5.8545 13.4211 20.2898 2.1196 0.0470 0.1377 0.2026 0.3765 0.5575 4.3417 21.2136 15.4509 0.3113 17.1022 5.8336 14.5297 14.6726 4.2630 0.7082 55.8149 25.6555 29.5597 64.2858 0.4177 0.0946 3.5811 1.9087 6.4445 17.7660 22.6618 13.1109 10.6068 24.2976 4.9277 50.9337 58.2916 27.2949 18.3125 5.3214 30.7710 0.3750 32.8007 12.2129 17.9114 11.0647 10.1114 2.3073 18.6827 19.3089 14.7893 147.0903 26.7091 501.1222 38.1274 147.5648 0.6559 34.7806 71.5245 4.5757 101.8689 131.2979 78.2144 173.7939 19.9944 24.9525 44.1656 5.6875 78.1214 21.4450 13.0943 2.4681 5.0576 6.7957 2.8020 32.4843 22.6748 25.6180 27.8364 18.5133 3.3219 3.4800 37.0620
temp: 298.150 k
press: 1.00000 atm
elementType: 8 7 7 7 7 6 6 6 6 6 6 6 6 6 6 6 6 6 6 6 6 6 6 6 6 1 1 1 1 1 1 1 1 1 1 1 1 1 1 1 1 1 1 1 1 1 1
symmnumber: 1
zpe: 998913.3 jmol-1
zpe.correction: 0.380466 hartree
zpe.thermalcorrener: 0.403806 hartree
zpe.thermalcorrenthalpy: 0.404750 hartree
zpe.thermalcorrgfe: 0.324739 hartree
zpe.sumelectzpe: -1067.740795 hartree
zpe.sumelectthermal: -1067.717455 hartree
zpe.sumelectthermalent: -1067.716511 hartree
zpe.sumelectthermalfe: -1067.796522 hartree
dipole: -4.0873 3.8105 0.6784
dipole: 5.6290
quadrupole: -126.8836 -142.1649 -148.0168
quadrupole: -9.4094 3.6153 0.7800
quadrupole: 12.1382 -3.1431 -8.9950 -9.4094 3.6153 0.7800
hfenergy: -1068.1212606 hartree
pointgroup: C01 [X(C20H22N4O1)]
dipole: -1.6739521 -1.3870925 -0.4223506 debye
polarizability: 360.873813|33.4397067|298.7584815|-11.3803089|24.0908591|150.5075347 unknown
InChI: InChI=1S/C20H22N4O/c1-15(23(2)3)20(25)21-19-14-18(16-10-6-4-7-11-16)22-24(19)17-12-8-5-9-13-17/h4-15,21H,1-3H3
charge 0 multiplicity 1
47 atoms
O  -1.588615 2.715677 0.587376
N  -4.300784 2.410832 -0.766683
N  0.324923 -1.087938 0.048674
N  -1.607609 0.409266 0.1943
N  1.725599 -1.04195 -0.014582
C  -3.779031 1.579135 0.343414
C  -0.220124 0.19478 0.205642
C  -2.231515 1.653061 0.373698
C  -4.294152 2.042699 1.725921
C  2.034386 0.285646 0.140561
C  0.852647 1.090563 0.278059
C  -0.343293 -2.341997 -0.110305
C  -5.774826 2.487131 -0.814521
C  -3.723535 2.037858 -2.074981
C  3.44261 0.725309 0.153785
C  -1.480548 -2.662625 0.675582
C  0.167158 -3.277974 -1.043211
C  3.775441 2.101144 0.278378
C  4.494316 -0.226001 0.039997
C  -2.129185 -3.903839 0.488666
C  -0.480659 -4.518894 -1.208332
C  5.124333 2.515413 0.287149
C  5.840415 0.190294 0.04913
C  -1.637595 -4.833307 -0.45541
C  6.163547 1.563337 0.172161
H  -4.075756 0.498608 0.198905
H  -2.209188 -0.391052 -0.021187
H  -4.05923 3.111672 1.859602
H  -5.380824 1.887594 1.830787
H  -3.794967 1.473927 2.530747
H  0.761031 2.16372 0.403566
H  -6.1708 2.957362 0.099679
H  -6.270269 1.489873 -0.941509
H  -6.06893 3.122463 -1.668089
H  -2.626049 2.148588 -2.05097
H  -4.10984 2.721359 -2.850615
H  -3.966684 0.988677 -2.387114
H  -1.813656 -1.985076 1.469637
H  1.064119 -3.019256 -1.611948
H  2.980692 2.849737 0.367727
H  4.235716 -1.285778 -0.050667
H  -3.00288 -4.152339 1.100988
H  -0.083993 -5.241391 -1.929736
H  5.364465 3.580189 0.383798
H  6.640118 -0.554029 -0.037952
H  -2.139527 -5.796796 -0.592466
H  7.210648 1.886129 0.179448
