program: Orca
programVersion: 5.0.2
elementType: S P O O O N C C C C C C C C C C C C C H H H H H H H H H H H H H H H H H H H H H H
charge: 0
multiplicity: 1
keywords: wb97x-d3
keywords: def2-TZVPP
keywords: def2/J RIJCOSX
keywords: DEFGRID2
keywords: scfconv7
keywords: smallprint printgap noloewdin
keywords: NOSOSCF
formula: C13H22NO3PS
InChI: InChI=1/C13H22NO3PS/c1-6-16-18(15,14-10(2)3)17-12-7-8-13(19-5)11(4)9-12/h7-10,14H,6H2,1-5H3
41 atoms
S  -4.805527 0.620748 -0.2980
P  2.113486 0.267256 0.642086
O  0.852543 -0.744272 0.74917
O  1.922133 0.715205 -0.885739
O  2.193222 1.339879 1.64907
N  3.415916 -0.735263 0.667177
C  3.595157 -1.923167 -0.15893
C  3.204726 -3.193669 0.586929
C  5.030175 -1.983165 -0.664522
C  -0.443902 -0.347944 0.523096
C  -2.531887 -0.808542 -0.601371
C  -1.200227 -1.104736 -0.35753
C  2.620781 1.862247 -1.377729
C  -1.011191 0.731164 1.175563
C  -3.109886 0.289638 0.054455
C  -2.340703 1.043698 0.931478
C  -3.331303 -1.646877 -1.552166
C  1.819179 3.128193 -1.175616
C  -5.164599 2.065372 0.710802
H  2.937014 -1.811216 -1.02356
H  3.960319 -0.70231 1.516305
H  2.173025 -3.145278 0.930973
H  3.308982 -4.070173 -0.053789
H  3.846203 -3.346549 1.457783
H  5.285206 -1.083671 -1.223714
H  5.178906 -2.844944 -1.315652
H  5.734767 -2.074974 0.165321
H  -0.73931 -1.946337 -0.859956
H  3.605025 1.948214 -0.907127
H  2.785737 1.673286 -2.439036
H  -0.433438 1.322585 1.872691
H  -2.764787 1.891073 1.451074
H  -4.199476 -2.091908 -1.06117
H  -3.707283 -1.05462 -2.389292
H  -2.730793 -2.457279 -1.9620
H  0.836269 3.046461 -1.638951
H  1.687625 3.343405 -0.116894
H  2.338991 3.971006 -1.632938
H  -5.048432 1.861291 1.77417
H  -6.20805 2.310484 0.522051
H  -4.555194 2.922616 0.428462
totalener: -1528.83235843 hartree
nucrepener: 1823.26906781 hartree
electener: -3352.10142625 hartree
oneelecener: -5722.09951502 hartree
twoeener: 2369.99808877 hartree
kineticenergy: 1523.76126766 hartree
xcener: -113.009743769389 hartree
chargesum: -0.0000000
charge: -0.046538 0.754174 -0.342088 -0.328201 -0.524748 -0.254224 0.069278 -0.247865 -0.234368 0.238320 0.041941 -0.159184 0.039349 -0.201337 -0.006872 -0.120076 -0.233172 -0.243557 -0.288479 0.059425 0.132778 0.099705 0.078746 0.072959 0.091006 0.079265 0.074659 0.094200 0.076433 0.088155 0.138247 0.110052 0.100930 0.102324 0.077528 0.084843 0.098217 0.080061 0.113847 0.121019 0.113248
qa: -0.0465 0.7542 -0.3421 -0.3282 -0.5247 -0.2542 0.0693 -0.2479 -0.2344 0.2383 0.0419 -0.1592 0.0393 -0.2013 -0.0069 -0.1201 -0.2332 -0.2436 -0.2885 0.0594 0.1328 0.0997 0.0787 0.0730 0.0910 0.0793 0.0747 0.0942 0.0764 0.0882 0.1382 0.1101 0.1009 0.1023 0.0775 0.0848 0.0982 0.0801 0.1138 0.1210 0.1132
va: 2.3847 5.6281 2.0881 2.0514 2.0906 3.0706 3.9160 3.9365 3.9349 3.8310 3.7196 4.0389 3.8966 4.0761 3.9609 3.8768 3.9032 3.9274 4.0099 1.0184 1.0409 1.0163 1.0090 1.0089 1.0107 1.0082 1.0083 1.0177 1.0046 0.9904 1.0267 1.0094 1.0003 0.9998 1.0091 1.0046 1.0211 1.0124 0.9940 1.0054 0.9940
dispcorr: -0.018786585 hartree
energy: -1528.851145020105
dipole: 9.65741 -9.24423 0.41318 -3.33622 3.04145 -0.29477 -7.58258 6.85522 -0.72736
magnitude: 0.88694 au
magnitude: 2.25442 debye
