program: Orca
programVersion: 5.0.2
elementType: S P O O O N C C C C C C C C C C C C C H H H H H H H H H H H H H H H H H H H H H H
charge: 0
multiplicity: 1
keywords: wb97x-d3
keywords: def2-TZVPP
keywords: def2/J RIJCOSX
keywords: DEFGRID2
keywords: scfconv7
keywords: smallprint printgap noloewdin
keywords: NOSOSCF
formula: C13H22NO3PS
InChI: InChI=1/C13H22NO3PS/c1-6-16-18(15,14-10(2)3)17-12-7-8-13(19-5)11(4)9-12/h7-10,14H,6H2,1-5H3
41 atoms
S  -4.711408 1.297196 -0.348371
P  2.021663 -0.144894 0.562698
O  0.761961 -0.929089 -0.102397
O  2.055683 1.118232 -0.422022
O  1.93018 0.136609 2.005936
N  3.310872 -1.074999 0.15391
C  3.669291 -1.50344 -1.1929
C  3.206663 -2.928248 -1.472501
C  5.169505 -1.343834 -1.398769
C  -0.495235 -0.381048 -0.126496
C  -2.455395 0.441196 1.018576
C  -1.163745 -0.073508 1.049548
C  2.593117 2.36927 0.021452
C  -1.09701 -0.176088 -1.355931
C  -3.074648 0.626741 -0.223316
C  -2.387658 0.321941 -1.393279
C  -3.148851 0.779173 2.304179
C  1.523801 3.227937 0.65781
C  -5.703134 -0.193309 -0.064202
H  3.16014 -0.830937 -1.886586
H  3.711416 -1.608748 0.91077
H  2.130231 -3.023756 -1.339769
H  3.451863 -3.22531 -2.492795
H  3.695215 -3.636123 -0.798935
H  5.479499 -0.313521 -1.228601
H  5.456361 -1.623871 -2.412636
H  5.729982 -1.982566 -0.712054
H  -0.672039 -0.232872 2.000348
H  3.424987 2.212841 0.713596
H  2.99692 2.848315 -0.871067
H  -0.562458 -0.407608 -2.267356
H  -2.874094 0.483968 -2.346105
H  -2.466635 0.697587 3.148735
H  -3.552366 1.790788 2.283196
H  -3.988669 0.109149 2.495725
H  1.149805 2.772412 1.573182
H  1.935679 4.206107 0.909361
H  0.686144 3.378761 -0.022639
H  -5.490666 -0.953733 -0.812698
H  -6.749427 0.097258 -0.146674
H  -5.538384 -0.606883 0.929006
totalener: -1528.83020325 hartree
nucrepener: 1828.88386577 hartree
electener: -3357.71406902 hartree
oneelecener: -5733.37985775 hartree
twoeener: 2375.66578873 hartree
kineticenergy: 1523.76749561 hartree
xcener: -113.004133890526 hartree
chargesum: 0.0000000
charge: -0.097803 0.757862 -0.342494 -0.333448 -0.524654 -0.249475 0.066021 -0.245375 -0.233606 0.254134 0.047054 -0.149972 0.037370 -0.200366 -0.057589 -0.075059 -0.219203 -0.243059 -0.277025 0.059515 0.132806 0.098958 0.078769 0.072438 0.092644 0.078536 0.074247 0.125159 0.083412 0.087648 0.113876 0.113165 0.088092 0.105256 0.089752 0.097141 0.082512 0.086521 0.110749 0.114548 0.100942
qa: -0.0978 0.7579 -0.3425 -0.3334 -0.5247 -0.2495 0.0660 -0.2454 -0.2336 0.2541 0.0471 -0.1500 0.0374 -0.2004 -0.0576 -0.0751 -0.2192 -0.2431 -0.2770 0.0595 0.1328 0.0990 0.0788 0.0724 0.0926 0.0785 0.0742 0.1252 0.0834 0.0876 0.1139 0.1132 0.0881 0.1053 0.0898 0.0971 0.0825 0.0865 0.1107 0.1145 0.1009
va: 2.2383 5.6215 2.0801 2.0574 2.0865 3.0813 3.9204 3.9371 3.9343 3.8085 3.6735 3.9673 3.8955 4.0763 3.8815 3.9482 3.9132 3.9203 3.9906 1.0187 1.0416 1.0160 1.0094 1.0088 1.0113 1.0083 1.0085 1.0318 1.0028 0.9910 1.0113 1.0193 1.0092 1.0058 0.9943 1.0186 1.0134 1.0043 0.9988 1.0029 0.9971
dispcorr: -0.019573423 hartree
energy: -1528.849776676707
dipole: 8.53782 -7.86139 0.67644 -2.46636 2.00691 -0.45945 -2.93121 2.18335 -0.74786
magnitude: 1.10813 au
magnitude: 2.81665 debye
