program: Orca
programVersion: 5.0.2
elementType: S P O O O N C C C C C C C C C C C C C H H H H H H H H H H H H H H H H H H H H H H
charge: 0
multiplicity: 1
keywords: wb97x-d3
keywords: def2-TZVPP
keywords: def2/J RIJCOSX
keywords: DEFGRID2
keywords: scfconv7
keywords: smallprint printgap noloewdin
keywords: NOSOSCF
formula: C13H22NO3PS
InChI: InChI=1/C13H22NO3PS/c1-6-16-18(15,14-10(2)3)17-12-7-8-13(19-5)11(4)9-12/h7-10,14H,6H2,1-5H3
41 atoms
S  -4.468959 1.798591 0.407339
P  2.036414 -0.505561 0.411624
O  0.595723 -1.248459 0.267103
O  1.948072 0.589573 -0.760612
O  2.372223 0.032213 1.74197
N  3.0080 -1.721097 -0.116626
C  4.382297 -1.886563 0.349565
C  5.36818 -1.04114 -0.448013
C  4.745292 -3.364001 0.311198
C  -0.567993 -0.529845 0.322039
C  -2.627569 0.097753 -0.777269
C  -1.419562 -0.588339 -0.770584
C  1.904401 2.002688 -0.532933
C  -0.899276 0.223049 1.437798
C  -2.965373 0.859662 0.349067
C  -2.0995 0.915716 1.434496
C  -3.525198 0.017594 -1.975424
C  0.629223 2.592901 -1.090861
C  -5.629103 0.52406 0.969897
H  4.397664 -1.554874 1.388759
H  2.813735 -2.116418 -1.025482
H  5.121059 0.01847 -0.382128
H  6.385163 -1.16972 -0.07539
H  5.363986 -1.322245 -1.503407
H  4.737858 -3.747977 -0.71209
H  4.043508 -3.953362 0.899767
H  5.746616 -3.525604 0.710346
H  -1.128505 -1.178189 -1.630839
H  2.001429 2.219011 0.532198
H  2.773569 2.431462 -1.036165
H  -0.237213 0.26471 2.291894
H  -2.373454 1.514204 2.293341
H  -3.051222 -0.537966 -2.783265
H  -4.464588 -0.484933 -1.739754
H  -3.784239 1.008694 -2.345894
H  0.518956 2.370666 -2.151891
H  -0.251371 2.220255 -0.568966
H  0.651513 3.677388 -0.977068
H  -6.607728 0.994361 1.053449
H  -5.341181 0.136586 1.944792
H  -5.700672 -0.298085 0.260218
totalener: -1528.82767369 hartree
nucrepener: 1828.03829374 hartree
electener: -3356.86596743 hartree
oneelecener: -5731.55677847 hartree
twoeener: 2374.69081104 hartree
kineticenergy: 1523.76494304 hartree
xcener: -113.004848945490 hartree
chargesum: 0.0000000
charge: -0.096564 0.807335 -0.342561 -0.346028 -0.537199 -0.245173 0.067479 -0.234363 -0.245270 0.197915 0.039433 -0.159148 0.030669 -0.162344 -0.045274 -0.086011 -0.215442 -0.210972 -0.274090 0.072277 0.114423 0.088711 0.080096 0.069179 0.069906 0.101970 0.078325 0.097282 0.097273 0.086874 0.144212 0.117947 0.081038 0.091580 0.106321 0.082097 0.064317 0.086853 0.115526 0.111996 0.099405
qa: -0.0966 0.8073 -0.3426 -0.3460 -0.5372 -0.2452 0.0675 -0.2344 -0.2453 0.1979 0.0394 -0.1591 0.0307 -0.1623 -0.0453 -0.0860 -0.2154 -0.2110 -0.2741 0.0723 0.1144 0.0887 0.0801 0.0692 0.0699 0.1020 0.0783 0.0973 0.0973 0.0869 0.1442 0.1179 0.0810 0.0916 0.1063 0.0821 0.0643 0.0869 0.1155 0.1120 0.0994
va: 2.2348 5.5969 2.1244 2.0530 2.0687 3.1204 3.9209 3.9257 3.9275 3.8545 3.6686 4.0114 3.8737 3.9459 3.8593 3.9146 3.9201 3.9175 3.9882 1.0240 1.0535 1.0126 1.0106 1.0100 1.0056 1.0104 1.0085 1.0223 1.0091 0.9918 1.0206 1.0191 1.0084 0.9958 1.0046 1.0080 1.0188 1.0146 1.0024 0.9990 0.9975
dispcorr: -0.020196242 hartree
energy: -1528.847869931088
dipole: 8.00485 -7.92193 0.08292 -2.64058 2.16702 -0.47356 -7.75805 6.71940 -1.03865
magnitude: 1.14452 au
magnitude: 2.90913 debye
