program: Gaussian 09
title: 000006162
version: EM64L-G09RevD.01
frameworkgroup: C1[X(C8H13NO2)]
method: RPBEPBE
basis: SDD
operation: Freq
keyword: #p
keyword: freq=noraman
keyword: PBEPBE/SDD
title: #p freq=noraman PBEPBE/SDD
converged: YES YES NO NO
title: Mulliken charges:
elementType: O O N C C C C C C C C H H H H H H H H H H H H H
charge: -0.225061 -0.223523 -0.357492 -0.122238 -0.465378 -0.135233 -0.386644 0.128982 0.142064 -0.713796 -0.714671 0.242135 0.230176 0.220864 0.241282 0.234191 0.195423 0.210624 0.219153 0.254253 0.346730 0.242687 0.214352 0.221121
chargesum: 0.00000
title: Mulliken charges with hydrogens summed into heavy atoms:
elementType: O O N C C C C C C C C
charge: -0.225061 -0.223523 -0.010762 0.119897 -0.014338 0.106048 0.042970 0.128982 0.142064 -0.029766 -0.036511
polarizability: 1.22904972e+02 3.78745677e+00 9.27623092e+01 -3.59973186e+00 3.20383772e+00 7.21017766e+01
1716.lowfreq: -15.5699 -8.3938 -0.0005 -0.0001 0.0002 12.7804 45.0374 89.3211 118.9567
frequency: 45.0042 89.2439 118.9449 140.8445 194.7514 199.5937 230.2009 273.9728 298.8932 341.9976 358.7679 392.3073 428.7931 488.3866 561.0482 617.8067 665.2309 703.4574 723.4141 773.5615 813.0426 816.2983 897.9624 915.1410 946.2253 1002.6184 1024.6978 1063.1467 1088.3809 1120.1823 1125.5928 1164.4388 1184.9760 1217.9984 1241.2608 1262.7627 1272.6048 1289.2700 1320.4535 1332.3454 1345.1751 1356.2756 1373.5215 1392.6184 1395.8107 1459.9693 1467.1905 1473.1998 1481.1701 1485.1738 1488.6798 1630.1709 1635.5703 2934.6522 2944.9456 2985.2711 2992.6078 2994.2386 2996.6720 3050.4446 3056.9773 3078.8900 3086.9115 3087.6181 3108.2864 3477.4111
redmass: 5.4943 2.3247 2.7415 8.3705 1.0621 1.3766 2.7228 2.1588 2.1013 2.9696 5.6869 4.7707 4.6097 3.8693 3.9894 3.7629 4.1029 3.6397 2.2631 1.5321 1.9213 1.6543 1.9796 1.8269 1.6898 1.7797 1.3696 2.1240 1.7445 1.8949 2.1064 2.3326 1.7586 2.6144 1.3604 1.5288 1.3743 1.6076 1.8305 1.9508 1.5916 1.4700 1.8055 1.2098 1.2210 1.0776 1.0628 1.0619 1.0576 1.0507 1.0481 10.9491 5.4204 1.0799 1.0809 1.0365 1.0390 1.0635 1.0571 1.0990 1.1030 1.0987 1.1002 1.1010 1.0994 1.0758
irintensity: 0.1068 0.2555 0.3171 7.8646 0.0878 1.0487 0.7181 2.9622 0.8889 4.9285 17.7244 18.6043 0.5177 0.1238 2.1615 1.9053 5.2884 7.5899 7.3668 5.9009 40.5830 79.3734 2.4057 3.8828 2.6558 1.1274 7.8695 4.1023 2.7818 5.5777 0.2085 6.9935 47.8737 315.7041 2.1111 12.4942 19.9761 20.4432 26.5866 19.8095 25.7314 9.2445 1.8591 28.2721 19.4668 17.5676 6.2659 13.5590 13.5895 12.3980 9.1030 113.8344 410.6873 14.9548 11.3548 21.8794 12.9592 33.9332 47.3964 2.6115 21.7943 48.6445 32.7703 40.0655 14.2232 31.2606
temp: 298.150 k
press: 1.00000 atm
elementType: 8 8 7 6 6 6 6 6 6 6 6 1 1 1 1 1 1 1 1 1 1 1 1 1
symmnumber: 1
zpe: 529497.5 jmol-1
zpe.correction: 0.201675 hartree
zpe.thermalcorrener: 0.212977 hartree
zpe.thermalcorrenthalpy: 0.213921 hartree
zpe.thermalcorrgfe: 0.164586 hartree
zpe.sumelectzpe: -517.025507 hartree
zpe.sumelectthermal: -517.014204 hartree
zpe.sumelectthermalent: -517.013260 hartree
zpe.sumelectthermalfe: -517.062596 hartree
dipole: 0.6892 -3.4774 -1.1164
dipole: 3.7167
quadrupole: -79.1378 -68.6479 -64.3454
quadrupole: -1.0906 2.1310 0.8452
quadrupole: -8.4274 2.0625 6.3649 -1.0906 2.1310 0.8452
hfenergy: -517.2271815 hartree
pointgroup: C01 [X(C8H13N1O2)]
dipole: 0.274637 1.3845816 0.3817187 debye
dipolederiv: -0.9994734 0.1603997 -0.0382603 0.3901983 -0.7622177 -0.0008241 0.0272319 -0.0623765 -0.3454432 -1.1378011 -0.0504118 -0.0914357 -0.261433 -0.6074001 -0.0700954 -0.1854926 -0.0730361 -0.3700167 -1.6694126 0.1866646 -0.1104217 0.2072807 -0.4760629 0.0218861 -0.134893 -0.0246116 -0.3238763 -0.0419492 -0.010038 0.0004617 -0.0586722 -0.1559984 -0.0777483 -0.0065507 -0.1466616 0.099327 -0.0798601 0.0169507 -0.0117978 0.0084609 0.0604769 0.0254343 -0.024221 0.0257337 0.1218232 0.0107067 -0.0235694 -0.0455699 0.0114903 -0.1689545 -0.0792349 -0.0543295 -0.1429855 0.130747 0.128199 0.0681492 -0.0035667 0.0497765 0.117713 0.0100342 -0.0364798 0.0338446 0.1041696 1.754489 -0.1440187 0.1522401 0.0657823 0.8839118 0.1338865 0.2214837 0.1972518 0.2483829 1.7076436 -0.1092592 0.1461405 -0.3520998 0.9362835 0.1355979 0.1396866 0.2323604 0.2498164 -0.0522983 -0.0155078 -0.0257162 0.0072593 0.0451412 0.0254712 0.0055282 0.0132575 0.0820281 -0.0055682 -0.0457552 0.0429973 -0.0410122 0.0535787 0.0052648 0.0501591 -0.0066593 -0.055253 0.0459041 -0.0076332 0.0694235 -0.0165759 0.0266217 0.0158636 0.0448353 0.0332634 -0.1199844 0.0618554 0.0030519 0.0035479 0.0046707 0.0698521 0.0012144 0.0266413 0.0431557 -0.1275193 0.0738132 -0.0363559 -0.0116509 -0.0336421 -0.1522983 -0.0536852 -0.0102105 -0.0744791 0.0554776 0.0590091 -0.0091374 -0.0238044 -0.0036049 0.0299099 0.0299622 0.0124209 0.0352281 -0.1210063 -0.0306298 0.0577968 -0.0497494 0.1163563 0.0323961 0.0883087 -0.0202279 0.0661779 -0.0020976 0.0454572 -0.0275563 0.0194112 -0.0817889 -0.119355 -0.1175196 0.0169874 -0.0941675 -0.0255981 0.0936226 -0.0300546 -0.0309008 0.0330629 -0.1386407 -0.0723398 -0.0149689 -0.0915052 0.0465708 0.0750971 0.0121761 0.0600237 0.0191211 0.0784568 -0.0034783 0.0024713 0.0472875 -0.1372682 -0.0904277 -0.0218156 0.0333162 -0.0917578 0.1016196 0.0253079 0.0263552 0.0262816 0.0882902 0.1011679 0.0175827 -0.0224527 0.0163093 0.1638682 -0.0329027 -0.0294019 -0.0450442 0.3034046 0.1083734 -0.0356038 -0.0353457 -0.0092575 -0.0719335 -0.111014 -0.0394044 -0.0708087 0.0228465 0.0201181 0.1252823 -0.0901733 0.0960906 -0.028653 0.0814398 -0.0554307 0.0619409 0.0030194 -0.1780359 -0.0813372 0.0632835 -0.076015 0.0816846 0.0191707 0.0378099 0.0165521 0.0721599 unknown
polarizability: 123.0989766|-3.4446763|92.9351233|2.3845226|2.5472022|71.7349582 unknown
InChI: InChI=1S/C8H13NO2/c1-3-6-4-5(2)7(10)9-8(6)11/h5-6,9H,3-4H2,1-2H3
charge 0 multiplicity 1
24 atoms
O  1.731915 -1.928489 0.127253
O  -2.799077 -1.136232 -0.305574
N  -0.51654 -1.428613 -0.074001
C  1.040606 0.392096 0.643961
C  -0.052367 1.31303 0.050616
C  -1.476367 0.828255 0.412697
C  2.494594 0.849282 0.354808
C  0.820017 -1.063952 0.214872
C  -1.682549 -0.628708 -0.020574
C  -2.587005 1.731194 -0.161784
C  2.851589 0.965649 -1.143318
H  0.910336 0.391025 1.750415
H  0.045506 1.363057 -1.050604
H  0.09138 2.340553 0.433594
H  -1.567863 0.824162 1.522033
H  3.180911 0.125391 0.830817
H  2.651053 1.826081 0.853716
H  -2.518235 2.744925 0.271243
H  -2.495405 1.815697 -1.259783
H  -3.582912 1.314307 0.059769
H  -0.661724 -2.409913 -0.344981
H  2.718762 -0.002746 -1.65781
H  2.238326 1.725172 -1.661474
H  3.909749 1.260674 -1.260989
