program: Orca
programVersion: 5.0.2
elementType: S P O O O N C C C C C C C C C C C C C H H H H H H H H H H H H H H H H H H H H H H
charge: 0
multiplicity: 1
keywords: wb97x-d3
keywords: def2-TZVPP
keywords: def2/J RIJCOSX
keywords: DEFGRID2
keywords: scfconv7
keywords: smallprint printgap noloewdin
keywords: NOSOSCF
formula: C13H22NO3PS
InChI: InChI=1/C13H22NO3PS/c1-6-16-18(15,14-10(2)3)17-12-7-8-13(19-5)11(4)9-12/h7-10,14H,6H2,1-5H3
41 atoms
S  -5.040084 0.603213 -0.152667
P  1.931325 -0.146846 0.036544
O  0.674163 -0.786798 -0.769536
O  1.770257 1.375481 -0.428297
O  1.974244 -0.412781 1.485533
N  3.254122 -0.699804 -0.779391
C  3.942943 -1.933174 -0.395214
C  5.374865 -1.879335 -0.906824
C  3.216841 -3.181073 -0.88506
C  -0.633683 -0.428126 -0.571106
C  -2.522064 0.035331 0.85951
C  -1.179593 -0.291924 0.697558
C  2.482883 2.405077 0.26605
C  -1.417019 -0.251964 -1.699693
C  -3.312477 0.222011 -0.280528
C  -2.754417 0.065513 -1.543869
C  -3.086824 0.174146 2.241784
C  1.656491 2.983232 1.391479
C  -4.962018 2.407095 0.012632
H  3.96552 -1.945398 0.695643
H  3.281277 -0.503591 -1.771022
H  5.892493 -0.995875 -0.535086
H  5.930699 -2.760062 -0.585506
H  5.405639 -1.857444 -1.99919
H  3.74864 -4.084229 -0.583201
H  3.141797 -3.189173 -1.974684
H  2.206916 -3.239364 -0.480491
H  -0.560828 -0.457832 1.569952
H  3.439209 2.029539 0.641614
H  2.705617 3.165204 -0.483564
H  -0.98403 -0.368932 -2.683975
H  -3.381021 0.198549 -2.415911
H  -3.414534 1.195843 2.439904
H  -3.956491 -0.466409 2.382873
H  -2.343926 -0.083636 2.994821
H  0.701543 3.357206 1.023011
H  1.465463 2.23701 2.160853
H  2.190265 3.816192 1.850532
H  -4.41093 2.705665 0.902618
H  -5.985626 2.768022 0.102078
H  -4.505525 2.861192 -0.864419
totalener: -1528.82991281 hartree
nucrepener: 1818.30205407 hartree
electener: -3347.13196688 hartree
oneelecener: -5712.17247606 hartree
twoeener: 2365.04050918 hartree
kineticenergy: 1523.75975947 hartree
xcener: -113.001005965918 hartree
chargesum: -0.0000000
charge: -0.098522 0.805591 -0.344208 -0.336887 -0.531415 -0.259082 0.070602 -0.247714 -0.234698 0.260111 0.049905 -0.161386 0.037693 -0.216522 -0.064813 -0.066764 -0.214175 -0.244014 -0.275360 0.072969 0.115989 0.096931 0.080305 0.070935 0.079901 0.069046 0.094036 0.131763 0.078913 0.089602 0.115254 0.112147 0.087169 0.105345 0.085600 0.083139 0.096824 0.082431 0.099391 0.114820 0.109149
qa: -0.0985 0.8056 -0.3442 -0.3369 -0.5314 -0.2591 0.0706 -0.2477 -0.2347 0.2601 0.0499 -0.1614 0.0377 -0.2165 -0.0648 -0.0668 -0.2142 -0.2440 -0.2754 0.0730 0.1160 0.0969 0.0803 0.0709 0.0799 0.0690 0.0940 0.1318 0.0789 0.0896 0.1153 0.1121 0.0872 0.1053 0.0856 0.0831 0.0968 0.0824 0.0994 0.1148 0.1091
va: 2.2366 5.5937 2.1092 2.0867 2.0673 3.1131 3.9321 3.9257 3.9199 3.8264 3.6787 3.9123 3.9087 4.0891 3.8904 3.9601 3.9209 3.9174 3.9899 1.0216 1.0499 1.0107 1.0088 1.0059 1.0107 1.0105 1.0181 1.0349 1.0040 0.9910 1.0146 1.0181 0.9956 1.0035 1.0101 1.0048 1.0192 1.0123 0.9971 1.0027 0.9988
dispcorr: -0.018822918 hartree
energy: -1528.848735727131
dipole: 12.73711 -11.75002 0.98708 3.17195 -2.41967 0.75228 3.34737 -4.04385 -0.69648
magnitude: 1.42314 au
magnitude: 3.61734 debye
