program: Orca
programVersion: 5.0.2
elementType: S P O O O N C C C C C C C C C C C C C H H H H H H H H H H H H H H H H H H H H H H
charge: 0
multiplicity: 1
keywords: wb97x-d3
keywords: def2-TZVPP
keywords: def2/J RIJCOSX
keywords: DEFGRID2
keywords: scfconv7
keywords: smallprint printgap noloewdin
keywords: NOSOSCF
formula: C13H22NO3PS
InChI: InChI=1/C13H22NO3PS/c1-6-16-18(15,14-10(2)3)17-12-7-8-13(19-5)11(4)9-12/h7-10,14H,6H2,1-5H3
41 atoms
S  -4.807019 0.823343 0.645108
P  2.015759 -0.223953 -0.038722
O  0.692184 -0.934801 -0.653911
O  1.846248 1.229174 -0.687526
O  2.160178 -0.297709 1.426042
N  3.267062 -0.90902 -0.866801
C  3.946484 -2.112408 -0.387811
C  5.361606 -2.137317 -0.946078
C  3.180391 -3.385063 -0.731102
C  -0.574411 -0.494494 -0.343849
C  -2.332428 -0.07463 1.25543
C  -1.039664 -0.485118 0.963293
C  2.519701 2.352241 -0.108577
C  -1.399265 -0.093137 -1.376343
C  -3.174122 0.325123 0.206089
C  -2.69674 0.307972 -1.098883
C  -2.814242 -0.059558 2.674712
C  1.684309 3.001172 0.971505
C  -5.549542 1.253663 -0.93544
H  4.005461 -2.01979 0.697954
H  3.238765 -0.821602 -1.873657
H  5.913762 -2.993718 -0.559143
H  5.356283 -2.219214 -2.035948
H  5.904195 -1.231906 -0.677203
H  3.70259 -4.267378 -0.358871
H  3.069921 -3.497117 -1.812026
H  2.182786 -3.378525 -0.293231
H  -0.38768 -0.801391 1.76711
H  3.497787 2.058096 0.282632
H  2.69452 3.04448 -0.932815
H  -1.034892 -0.097368 -2.394871
H  -3.325484 0.612716 -1.923284
H  -3.684092 -0.705805 2.810776
H  -2.037013 -0.399303 3.356724
H  -3.111598 0.944654 2.984643
H  1.550185 2.332007 1.819341
H  2.17968 3.905695 1.326802
H  0.702408 3.28105 0.590902
H  -6.567995 1.566035 -0.712082
H  -5.594765 0.40163 -1.612368
H  -5.035632 2.08449 -1.417115
totalener: -1528.83150549 hartree
nucrepener: 1819.14064627 hartree
electener: -3347.97215177 hartree
oneelecener: -5714.02310299 hartree
twoeener: 2366.05095122 hartree
kineticenergy: 1523.76180035 hartree
xcener: -113.006971985307 hartree
chargesum: 0.0000000
charge: -0.042356 0.819391 -0.355344 -0.343018 -0.536762 -0.259470 0.070364 -0.246462 -0.235118 0.233657 0.038824 -0.131302 0.034290 -0.219472 -0.010698 -0.124139 -0.236440 -0.244155 -0.289552 0.071523 0.114256 0.079615 0.070273 0.096844 0.079542 0.068141 0.093710 0.121272 0.080132 0.088006 0.110868 0.108491 0.100265 0.083119 0.101108 0.099347 0.080397 0.084656 0.121461 0.112581 0.112154
qa: -0.0424 0.8194 -0.3553 -0.3430 -0.5368 -0.2595 0.0704 -0.2465 -0.2351 0.2337 0.0388 -0.1313 0.0343 -0.2195 -0.0107 -0.1241 -0.2364 -0.2442 -0.2896 0.0715 0.1143 0.0796 0.0703 0.0968 0.0795 0.0681 0.0937 0.1213 0.0801 0.0880 0.1109 0.1085 0.1003 0.0831 0.1011 0.0993 0.0804 0.0847 0.1215 0.1126 0.1122
va: 2.3871 5.5899 2.0906 2.0899 2.0634 3.1168 3.9315 3.9258 3.9219 3.8315 3.7077 3.9302 3.9133 4.1623 3.9759 3.8828 3.9083 3.9127 4.0097 1.0227 1.0513 1.0087 1.0061 1.0112 1.0104 1.0107 1.0180 1.0321 1.0027 0.9907 1.0168 1.0078 0.9995 1.0103 0.9999 1.0197 1.0123 1.0047 1.0052 0.9938 0.9941
dispcorr: -0.018371084 hartree
energy: -1528.849876579033
dipole: 10.31299 -10.06317 0.24982 -0.93164 1.25617 0.32453 -1.50866 0.28575 -1.22291
magnitude: 1.28967 au
magnitude: 3.27808 debye
