program: Orca
programVersion: 5.0.2
elementType: S P O O O N C C C C C C C C C C C C C H H H H H H H H H H H H H H H H H H H H H H
charge: 0
multiplicity: 1
keywords: wb97x-d3
keywords: def2-TZVPP
keywords: def2/J RIJCOSX
keywords: DEFGRID2
keywords: scfconv7
keywords: smallprint printgap noloewdin
keywords: NOSOSCF
formula: C13H22NO3PS
InChI: InChI=1/C13H22NO3PS/c1-6-16-18(15,14-10(2)3)17-12-7-8-13(19-5)11(4)9-12/h7-10,14H,6H2,1-5H3
41 atoms
S  -4.824328 -0.777011 0.577498
P  2.073072 0.546477 0.374484
O  0.679071 1.325887 0.051468
O  3.085225 1.642586 -0.198438
O  2.273435 0.142499 1.777853
N  2.081217 -0.691373 -0.704694
C  2.739235 -1.970367 -0.449913
C  4.168612 -1.985076 -0.977817
C  1.899452 -3.09591 -1.036628
C  -0.565307 0.780189 0.202028
C  -2.885846 0.90221 -0.482151
C  -1.574658 1.352009 -0.561492
C  3.442626 2.782285 0.595932
C  -0.85074 -0.264738 1.069093
C  -3.172151 -0.166452 0.376927
C  -2.155166 -0.727003 1.139024
C  -3.951393 1.559448 -1.30682
C  4.676318 2.506752 1.425596
C  -4.951377 -1.888742 -0.848592
H  2.766291 -2.091705 0.633938
H  1.919788 -0.475591 -1.677528
H  4.190541 -1.840709 -2.060386
H  4.761313 -1.19207 -0.521723
H  4.656672 -2.936373 -0.762323
H  0.886831 -3.074017 -0.635258
H  2.339204 -4.06651 -0.806108
H  1.83455 -3.017661 -2.124738
H  -1.326216 2.173965 -1.221735
H  3.620928 3.590926 -0.113199
H  2.610399 3.090585 1.234478
H  -0.088919 -0.698603 1.701382
H  -2.393502 -1.538223 1.814373
H  -4.801913 1.853795 -0.693162
H  -3.567472 2.445643 -1.809812
H  -4.335941 0.887606 -2.075931
H  4.966718 3.408733 1.965077
H  4.489885 1.720667 2.155038
H  5.514638 2.209137 0.796173
H  -5.932532 -2.358927 -0.802482
H  -4.18967 -2.664439 -0.808075
H  -4.871784 -1.351142 -1.791658
totalener: -1528.82949423 hartree
nucrepener: 1810.16449208 hartree
electener: -3338.99398631 hartree
oneelecener: -5695.77672750 hartree
twoeener: 2356.78274119 hartree
kineticenergy: 1523.75637563 hartree
xcener: -113.003186904103 hartree
chargesum: -0.0000000
charge: -0.097668 0.792542 -0.325819 -0.346073 -0.527663 -0.227455 0.070745 -0.236769 -0.239890 0.230989 0.059401 -0.182126 0.037319 -0.195348 -0.064499 -0.074027 -0.219553 -0.246805 -0.277773 0.073409 0.117381 0.069116 0.091657 0.079680 0.096924 0.080545 0.069985 0.105505 0.088152 0.081198 0.136998 0.115874 0.107522 0.081529 0.089939 0.081461 0.101200 0.078313 0.114872 0.110679 0.098535
qa: -0.0977 0.7925 -0.3258 -0.3461 -0.5277 -0.2275 0.0707 -0.2368 -0.2399 0.2310 0.0594 -0.1821 0.0373 -0.1953 -0.0645 -0.0740 -0.2196 -0.2468 -0.2778 0.0734 0.1174 0.0691 0.0917 0.0797 0.0969 0.0805 0.0700 0.1055 0.0882 0.0812 0.1370 0.1159 0.1075 0.0815 0.0899 0.0815 0.1012 0.0783 0.1149 0.1107 0.0985
va: 2.2387 5.5973 2.1414 2.1009 2.0554 3.0737 3.9093 3.9372 3.9300 3.9269 3.6771 3.9953 3.9112 3.9384 3.8835 3.9492 3.9148 3.9158 3.9906 1.0247 1.0494 1.0097 1.0127 1.0101 1.0097 1.0090 1.0072 1.0225 0.9929 1.0022 1.0326 1.0201 1.0056 1.0089 0.9944 1.0115 1.0188 1.0047 1.0031 0.9987 0.9967
dispcorr: -0.018743596 hartree
energy: -1528.848237824532
dipole: 9.96344 -9.45974 0.50370 -7.51640 7.38914 -0.12726 -9.31551 7.84424 -1.47127
magnitude: 1.56031 au
magnitude: 3.96598 debye
