program: Orca
programVersion: 5.0.2
elementType: S P O O O N C C C C C C C C C C C C C H H H H H H H H H H H H H H H H H H H H H H
charge: 0
multiplicity: 1
keywords: wb97x-d3
keywords: def2-TZVPP
keywords: def2/J RIJCOSX
keywords: DEFGRID2
keywords: scfconv7
keywords: smallprint printgap noloewdin
keywords: NOSOSCF
formula: C13H22NO3PS
InChI: InChI=1/C13H22NO3PS/c1-6-16-18(15,14-10(2)3)17-12-7-8-13(19-5)11(4)9-12/h7-10,14H,6H2,1-5H3
41 atoms
S  -4.979761 0.820957 0.045072
P  1.919159 -0.227092 0.669519
O  0.652211 -0.992244 0.005584
O  1.847429 1.13631 -0.171344
O  1.922725 -0.086585 2.136039
N  3.205912 -1.072907 0.091129
C  3.459737 -1.393534 -1.308846
C  2.966962 -2.788807 -1.674223
C  4.943197 -1.228331 -1.610393
C  -0.640226 -0.531844 0.027077
C  -2.518197 0.517896 1.121019
C  -1.194324 0.101489 1.130854
C  2.454394 2.329548 0.32826
C  -1.413158 -0.767274 -1.094218
C  -3.303858 0.275707 -0.015658
C  -2.739798 -0.36826 -1.109706
C  -3.095494 1.209644 2.318867
C  3.96018 2.333015 0.169625
C  -5.653768 0.256522 -1.522487
H  2.910084 -0.662706 -1.906309
H  3.660957 -1.666998 0.768386
H  3.134672 -2.996018 -2.7318
H  3.499851 -3.552202 -1.102801
H  1.90315 -2.897301 -1.470883
H  5.543213 -1.925362 -1.020552
H  5.279671 -0.217974 -1.381033
H  5.151523 -1.428379 -2.661684
H  -0.598676 0.262109 2.020586
H  2.008154 3.140118 -0.247944
H  2.179857 2.475124 1.375188
H  -0.98295 -1.264206 -1.953561
H  -3.322988 -0.567024 -1.997642
H  -3.943763 0.657797 2.729698
H  -2.35289 1.31551 3.10812
H  -3.457272 2.20912 2.066827
H  4.356353 3.301438 0.476966
H  4.43402 1.569928 0.786253
H  4.250717 2.167132 -0.868029
H  -5.601104 -0.826648 -1.622343
H  -5.170277 0.731791 -2.374553
H  -6.702319 0.548498 -1.519776
totalener: -1528.83123963 hartree
nucrepener: 1819.22261079 hartree
electener: -3348.05385042 hartree
oneelecener: -5713.95177388 hartree
twoeener: 2365.89792346 hartree
kineticenergy: 1523.75181242 hartree
xcener: -113.010032058306 hartree
chargesum: -0.0000000
charge: -0.043681 0.747362 -0.333985 -0.329922 -0.521469 -0.247801 0.064247 -0.244773 -0.235813 0.238804 0.038531 -0.124996 0.042541 -0.231297 -0.016888 -0.123310 -0.238093 -0.260979 -0.289292 0.061561 0.132971 0.078376 0.073218 0.097750 0.075866 0.091172 0.081240 0.124686 0.089246 0.092821 0.111328 0.108296 0.100988 0.082984 0.099883 0.092861 0.093408 0.076468 0.113610 0.110513 0.121569
qa: -0.0437 0.7474 -0.3340 -0.3299 -0.5215 -0.2478 0.0642 -0.2448 -0.2358 0.2388 0.0385 -0.1250 0.0425 -0.2313 -0.0169 -0.1233 -0.2381 -0.2610 -0.2893 0.0616 0.1330 0.0784 0.0732 0.0977 0.0759 0.0912 0.0812 0.1247 0.0892 0.0928 0.1113 0.1083 0.1010 0.0830 0.0999 0.0929 0.0934 0.0765 0.1136 0.1105 0.1216
va: 2.3865 5.6185 2.1105 2.0568 2.0958 3.0513 3.9111 3.9413 3.9300 3.8749 3.7305 3.9139 3.8805 4.1156 3.9828 3.8824 3.9104 3.9166 4.0100 1.0206 1.0414 1.0089 1.0092 1.0159 1.0082 1.0078 1.0092 1.0406 0.9894 1.0082 1.0131 1.0083 1.0009 1.0103 0.9986 1.0156 1.0121 1.0034 0.9945 0.9933 1.0052
dispcorr: -0.019109087 hartree
energy: -1528.850348720013
dipole: 13.79391 -13.29922 0.49469 0.20525 -0.18971 0.01554 -9.92904 8.51094 -1.41810
magnitude: 1.50199 au
magnitude: 3.81775 debye
