program: Orca
programVersion: 5.0.2
elementType: S P O O O N C C C C C C C C C C C C C H H H H H H H H H H H H H H H H H H H H H H
charge: 0
multiplicity: 1
keywords: wb97x-d3
keywords: def2-TZVPP
keywords: def2/J RIJCOSX
keywords: DEFGRID2
keywords: scfconv7
keywords: smallprint printgap noloewdin
keywords: NOSOSCF
formula: C13H22NO3PS
InChI: InChI=1/C13H22NO3PS/c1-6-16-18(15,14-10(2)3)17-12-7-8-13(19-5)11(4)9-12/h7-10,14H,6H2,1-5H3
41 atoms
S  -4.963068 -0.359766 -0.256181
P  1.985358 0.582053 0.27433
O  0.67296 1.428325 -0.188686
O  3.106017 1.576946 -0.281867
O  2.064757 0.248627 1.708027
N  1.986642 -0.718378 -0.730237
C  2.557057 -2.01029 -0.353446
C  4.042101 -2.099264 -0.68336
C  1.760314 -3.123711 -1.016776
C  -0.607413 0.950456 -0.166741
C  -2.379481 -0.409826 0.752893
C  -1.057458 0.023558 0.764472
C  3.536102 2.701422 0.496463
C  -1.47281 1.463432 -1.120383
C  -3.251964 0.104297 -0.2134
C  -2.789479 1.040204 -1.131138
C  -2.839645 -1.403371 1.777761
C  4.684642 2.334155 1.408374
C  -4.875043 -1.854271 -1.277694
H  2.434524 -2.096682 0.727045
H  1.917444 -0.551196 -1.723883
H  4.214251 -1.997482 -1.756958
H  4.60338 -1.313995 -0.17731
H  4.455046 -3.059692 -0.372165
H  1.849712 -3.082114 -2.105086
H  0.704018 -3.051565 -0.76046
H  2.124967 -4.100357 -0.698168
H  -0.386555 -0.348763 1.527887
H  3.839627 3.458451 -0.227032
H  2.705413 3.118841 1.071557
H  -1.117106 2.191231 -1.837463
H  -3.476069 1.442304 -1.864419
H  -3.136309 -2.346864 1.317079
H  -2.049658 -1.620859 2.4946
H  -3.707344 -1.036399 2.324302
H  5.043162 3.224474 1.926189
H  4.374374 1.608061 2.15743
H  5.518355 1.919329 0.841816
H  -5.892167 -2.226204 -1.391872
H  -4.274007 -2.630424 -0.807558
H  -4.472032 -1.631943 -2.263638
totalener: -1528.82941556 hartree
nucrepener: 1820.02816599 hartree
electener: -3348.85758155 hartree
oneelecener: -5715.51493168 hartree
twoeener: 2366.65735013 hartree
kineticenergy: 1523.75919252 hartree
xcener: -113.003564855865 hartree
chargesum: -0.0000000
charge: -0.098146 0.789864 -0.326004 -0.345003 -0.528713 -0.226410 0.072763 -0.234849 -0.243296 0.215844 0.056109 -0.155630 0.040263 -0.213271 -0.069112 -0.062626 -0.215439 -0.249960 -0.275511 0.072391 0.117915 0.069526 0.090065 0.079100 0.071006 0.097988 0.079997 0.125328 0.087650 0.081848 0.120761 0.112778 0.085828 0.085635 0.106228 0.082737 0.102185 0.077997 0.115315 0.098352 0.108495
qa: -0.0981 0.7899 -0.3260 -0.3450 -0.5287 -0.2264 0.0728 -0.2348 -0.2433 0.2158 0.0561 -0.1556 0.0403 -0.2133 -0.0691 -0.0626 -0.2154 -0.2500 -0.2755 0.0724 0.1179 0.0695 0.0901 0.0791 0.0710 0.0980 0.0800 0.1253 0.0876 0.0818 0.1208 0.1128 0.0858 0.0856 0.1062 0.0827 0.1022 0.0780 0.1153 0.0984 0.1085
va: 2.2368 5.5936 2.1377 2.0965 2.0534 3.0728 3.9107 3.9351 3.9289 3.9345 3.6622 3.8680 3.9071 4.0436 3.8885 3.9562 3.9230 3.9131 3.9910 1.0239 1.0494 1.0101 1.0129 1.0103 1.0065 1.0087 1.0088 1.0395 0.9928 1.0020 1.0142 1.0177 0.9954 1.0101 1.0039 1.0117 1.0186 1.0044 1.0029 0.9969 0.9987
dispcorr: -0.018980271 hartree
energy: -1528.848395830647
dipole: 12.35622 -11.63656 0.71966 -14.16823 13.63805 -0.53018 -1.66270 0.57648 -1.08622
magnitude: 1.40673 au
magnitude: 3.57561 debye
