program: Orca
programVersion: 5.0.2
elementType: S P O O O N C C C C C C C C C C C C C H H H H H H H H H H H H H H H H H H H H H H
charge: 0
multiplicity: 1
keywords: wb97x-d3
keywords: def2-TZVPP
keywords: def2/J RIJCOSX
keywords: DEFGRID2
keywords: scfconv7
keywords: smallprint printgap noloewdin
keywords: NOSOSCF
formula: C13H22NO3PS
InChI: InChI=1/C13H22NO3PS/c1-6-16-18(15,14-10(2)3)17-12-7-8-13(19-5)11(4)9-12/h7-10,14H,6H2,1-5H3
41 atoms
S  -4.757889 -1.175577 0.34198
P  2.076965 0.495873 0.332171
O  0.671332 1.095045 -0.23067
O  3.062905 1.564173 -0.331453
O  2.174154 0.341687 1.79415
N  2.266071 -0.897779 -0.516977
C  3.069714 -2.016688 -0.028653
C  4.534326 -1.884038 -0.428153
C  2.462148 -3.322243 -0.518725
C  -0.555682 0.520327 -0.051569
C  -2.838447 0.426956 -0.854981
C  -1.54272 0.917727 -0.944266
C  3.222251 2.866378 0.246254
C  -0.84388 -0.392103 0.953033
C  -3.132597 -0.490463 0.161469
C  -2.133614 -0.890925 1.038922
C  -3.87988 0.883872 -1.832769
C  4.347173 2.888487 1.255354
C  -5.506818 0.077231 1.418006
H  3.000281 -1.992203 1.059989
H  2.154457 -0.857077 -1.520188
H  5.123722 -2.712691 -0.033788
H  4.646897 -1.885992 -1.514545
H  4.962877 -0.956701 -0.048203
H  1.420207 -3.406363 -0.212111
H  3.0076 -4.176066 -0.116621
H  2.501971 -3.394382 -1.608406
H  -1.287262 1.628739 -1.72057
H  3.434639 3.533887 -0.589394
H  2.289025 3.207948 0.702178
H  -0.097108 -0.69719 1.672314
H  -2.373476 -1.60596 1.815111
H  -4.342676 0.041147 -2.345188
H  -4.684666 1.427985 -1.336032
H  -3.449572 1.546193 -2.582656
H  4.124174 2.246497 2.105701
H  5.284324 2.560667 0.805533
H  4.490623 3.904759 1.62406
H  -5.540153 1.052884 0.936101
H  -4.965329 0.157842 2.358446
H  -6.526918 -0.241678 1.627287
totalener: -1528.82988811 hartree
nucrepener: 1805.22442441 hartree
electener: -3334.05431252 hartree
oneelecener: -5685.95804590 hartree
twoeener: 2351.90373338 hartree
kineticenergy: 1523.76262642 hartree
xcener: -113.003750050745 hartree
chargesum: -0.0000000
charge: -0.101904 0.790176 -0.326497 -0.344920 -0.527176 -0.226607 0.067880 -0.234987 -0.241786 0.232182 0.055759 -0.184287 0.037503 -0.181345 -0.065493 -0.079570 -0.209670 -0.246223 -0.274256 0.073702 0.118267 0.079981 0.069368 0.089275 0.100084 0.079576 0.070626 0.104888 0.088295 0.079743 0.133440 0.115671 0.105250 0.088517 0.080016 0.101708 0.078226 0.081134 0.098308 0.110783 0.114359
qa: -0.1019 0.7902 -0.3265 -0.3449 -0.5272 -0.2266 0.0679 -0.2350 -0.2418 0.2322 0.0558 -0.1843 0.0375 -0.1813 -0.0655 -0.0796 -0.2097 -0.2462 -0.2743 0.0737 0.1183 0.0800 0.0694 0.0893 0.1001 0.0796 0.0706 0.1049 0.0883 0.0797 0.1334 0.1157 0.1053 0.0885 0.0800 0.1017 0.0782 0.0811 0.0983 0.1108 0.1144
va: 2.2319 5.6017 2.1430 2.0996 2.0573 3.0751 3.9166 3.9324 3.9276 3.9286 3.6900 3.9922 3.9115 3.9356 3.8949 3.9516 3.9237 3.9164 3.9928 1.0234 1.0487 1.0104 1.0100 1.0145 1.0096 1.0086 1.0068 1.0225 0.9925 1.0024 1.0352 1.0183 1.0026 0.9964 1.0085 1.0187 1.0048 1.0116 0.9972 0.9982 1.0029
dispcorr: -0.018608761 hartree
energy: -1528.848496874008
dipole: 9.58538 -9.17123 0.41416 -1.43744 1.84949 0.41206 -1.87126 1.09605 -0.77520
magnitude: 0.97070 au
magnitude: 2.46732 debye
