program: Orca
programVersion: 5.0.2
elementType: S P O O O N C C C C C C C C C C C C C H H H H H H H H H H H H H H H H H H H H H H
charge: 0
multiplicity: 1
keywords: wb97x-d3
keywords: def2-TZVPP
keywords: def2/J RIJCOSX
keywords: DEFGRID2
keywords: scfconv7
keywords: smallprint printgap noloewdin
keywords: NOSOSCF
formula: C13H22NO3PS
InChI: InChI=1/C13H22NO3PS/c1-6-16-18(15,14-10(2)3)17-12-7-8-13(19-5)11(4)9-12/h7-10,14H,6H2,1-5H3
41 atoms
S  -4.727166 1.143734 0.064143
P  2.024703 -0.290583 0.556898
O  0.725747 -1.148947 0.094914
O  1.864047 0.938206 -0.45867
O  2.123177 0.039349 1.989153
N  3.292405 -1.178038 0.001059
C  3.450815 -1.673342 -1.361667
C  2.998392 -3.122596 -1.497511
C  4.89496 -1.490886 -1.8098
C  -0.530528 -0.590148 0.083632
C  -2.407254 0.396698 1.235006
C  -1.125858 -0.136218 1.250962
C  2.445876 2.209036 -0.15716
C  -1.208391 -0.514287 -1.117086
C  -3.100558 0.465282 0.016951
C  -2.491794 0.007277 -1.145379
C  -3.033538 0.888997 2.504678
C  1.463592 3.093206 0.576016
C  -5.310236 0.939414 -1.624348
H  2.819464 -1.052028 -2.000881
H  3.821799 -1.661335 0.711177
H  3.609323 -3.781583 -0.876334
H  1.959314 -3.240221 -1.194747
H  3.093455 -3.465018 -2.528767
H  5.026581 -1.81748 -2.841736
H  5.575456 -2.081031 -1.191611
H  5.197207 -0.446723 -1.740196
H  -0.586171 -0.200561 2.187435
H  3.365845 2.090395 0.421557
H  2.720055 2.645114 -1.118391
H  -0.739625 -0.861847 -2.028023
H  -3.004103 0.055557 -2.09563
H  -3.287014 1.949574 2.440369
H  -3.958317 0.353449 2.729495
H  -2.359554 0.76112 3.349709
H  1.892045 4.086115 0.718088
H  0.538067 3.200553 0.011154
H  1.226001 2.6825 1.555872
H  -4.730057 1.525031 -2.336016
H  -6.33388 1.308984 -1.63445
H  -5.321064 -0.106995 -1.926424
totalener: -1528.83161021 hartree
nucrepener: 1833.20694157 hartree
electener: -3362.03855177 hartree
oneelecener: -5742.02577013 hartree
twoeener: 2379.98721836 hartree
kineticenergy: 1523.76170327 hartree
xcener: -113.009184309390 hartree
chargesum: -0.0000000
charge: -0.043386 0.750398 -0.347280 -0.328829 -0.523188 -0.251269 0.069447 -0.246322 -0.234152 0.239241 0.044644 -0.143118 0.037237 -0.210243 -0.006921 -0.128842 -0.235071 -0.242568 -0.288572 0.055870 0.132324 0.072223 0.099709 0.078259 0.078247 0.074462 0.092269 0.123075 0.081774 0.086638 0.109245 0.108706 0.100543 0.100838 0.083822 0.082791 0.085460 0.096505 0.110467 0.121855 0.113709
qa: -0.0434 0.7504 -0.3473 -0.3288 -0.5232 -0.2513 0.0694 -0.2463 -0.2342 0.2392 0.0446 -0.1431 0.0372 -0.2102 -0.0069 -0.1288 -0.2351 -0.2426 -0.2886 0.0559 0.1323 0.0722 0.0997 0.0783 0.0782 0.0745 0.0923 0.1231 0.0818 0.0866 0.1092 0.1087 0.1005 0.1008 0.0838 0.0828 0.0855 0.0965 0.1105 0.1219 0.1137
va: 2.3863 5.6267 2.0766 2.0517 2.0915 3.0720 3.9220 3.9357 3.9346 3.8225 3.7087 3.9640 3.8994 4.1347 3.9714 3.8732 3.9069 3.9215 4.0093 1.0184 1.0414 1.0091 1.0164 1.0089 1.0081 1.0085 1.0114 1.0299 1.0036 0.9912 1.0127 1.0082 0.9987 1.0012 1.0100 1.0133 1.0044 1.0186 0.9931 1.0052 0.9952
dispcorr: -0.019238106 hartree
energy: -1528.850848311514
dipole: 8.56403 -8.27765 0.28638 0.99453 -0.98143 0.01310 -9.23640 7.75955 -1.47685
magnitude: 1.50442 au
magnitude: 3.82394 debye
