program: Orca
programVersion: 5.0.2
elementType: S S P O O O O O N C C C C C C C C C C H H H H H H H H H H H H H H H H
charge: 0
multiplicity: 1
keywords: wb97x-d3
keywords: def2-TZVPP
keywords: def2/J RIJCOSX
keywords: DEFGRID2
keywords: scfconv7
keywords: smallprint printgap noloewdin
keywords: NOSOSCF
formula: C10H16NO5PS2
InChI: InChI=1/C10H16NO5PS2/c1-11(2)19(12,13)10-7-5-9(6-8-10)16-17(18,14-3)15-4/h5-8H,1-4H3
35 atoms
S  -3.679842 -0.673131 -0.04963
S  3.294485 -0.872147 1.868541
P  3.290841 -0.120929 0.109533
O  2.01041 0.817618 -0.255334
O  -4.056669 -1.249874 -1.331372
O  -3.961464 -1.417955 1.167544
O  4.456278 0.883911 -0.286182
O  3.363417 -1.222936 -1.02548
N  -4.460617 0.785694 0.070512
C  -1.946419 -0.314543 -0.095265
C  -1.265695 -0.065724 1.091569
C  -1.302589 -0.221625 -1.322238
C  0.706788 0.392204 -0.179114
C  0.069152 0.298548 1.049625
C  0.037547 0.121386 -1.362257
C  -4.33863 1.642751 -1.10613
C  -4.234706 1.518397 1.31359
C  4.804124 2.001385 0.54247
C  3.538834 -0.910935 -2.418697
H  -1.758247 -0.148274 2.051004
H  -1.82636 -0.419184 -2.246863
H  0.602264 0.516009 1.964506
H  0.554997 0.193042 -2.309813
H  -5.0471 2.460548 -0.99191
H  -4.600921 1.106384 -2.012781
H  -3.338628 2.072675 -1.215698
H  -3.241649 1.974681 1.362142
H  -4.381046 0.880582 2.180286
H  -4.972953 2.316219 1.365465
H  4.870304 1.709042 1.590647
H  4.074366 2.802399 0.431889
H  5.776901 2.349814 0.207217
H  3.174725 -1.770095 -2.975086
H  4.59446 -0.760133 -2.637595
H  2.973379 -0.029582 -2.718796
elementType: S P O N C H
totalener: -1959.51870621 hartree
nucrepener: 2011.84687292 hartree
electener: -3971.36557913 hartree
oneelecener: -6696.23719837 hartree
twoeener: 2724.87161924 hartree
cpcmener: -0.04419466 hartree
kineticenergy: 1953.65168657 hartree
xcener: -131.803047013440 hartree
chargesum: -0.0000000
charge: 0.883751 -0.430719 0.733163 -0.348497 -0.549468 -0.547067 -0.331701 -0.346396 -0.152957 -0.021208 -0.162736 -0.140708 0.256501 -0.149556 -0.149660 -0.211827 -0.218696 -0.101249 -0.123727 0.161807 0.155823 0.154430 0.165164 0.123990 0.125412 0.113877 0.112660 0.127608 0.125310 0.103124 0.127671 0.129475 0.132951 0.129062 0.124391
qa: 0.8838 -0.4307 0.7332 -0.3485 -0.5495 -0.5471 -0.3317 -0.3464 -0.1530 -0.0212 -0.1627 -0.1407 0.2565 -0.1496 -0.1497 -0.2118 -0.2187 -0.1012 -0.1237 0.1618 0.1558 0.1544 0.1652 0.1240 0.1254 0.1139 0.1127 0.1276 0.1253 0.1031 0.1277 0.1295 0.1330 0.1291 0.1244
va: 5.8310 2.0220 5.5066 2.0676 1.9413 1.9428 2.0882 2.0999 2.9468 3.6834 3.9956 3.9864 3.7847 4.0162 4.0128 3.9218 3.9221 3.8288 3.8335 0.9990 1.0110 1.0076 0.9894 0.9931 1.0081 0.9879 0.9873 1.0059 0.9950 1.0041 0.9890 0.9883 0.9883 0.9933 0.9900
dispcorr: -0.018177475 hartree
energy: -1959.536883686786
dipole: -5.58878 7.29010 1.70131 14.79826 -10.83467 3.96359 -5.72536 4.13104 -1.59432
magnitude: 4.59852 au
magnitude: 11.68851 debye
