program: Orca
programVersion: 5.0.2
elementType: S S P O O O O O N C C C C C C C C C C H H H H H H H H H H H H H H H H
charge: 0
multiplicity: 1
keywords: wb97x-d3
keywords: def2-TZVPP
keywords: def2/J RIJCOSX
keywords: DEFGRID2
keywords: scfconv7
keywords: smallprint printgap noloewdin
keywords: NOSOSCF
formula: C10H16NO5PS2
InChI: InChI=1/C10H16NO5PS2/c1-11(2)19(12,13)10-7-5-9(6-8-10)16-17(18,14-3)15-4/h5-8H,1-4H3
35 atoms
S  -3.742021 0.208141 -0.241555
S  3.440404 0.786223 2.065402
P  3.185756 0.256039 0.244827
O  2.075353 1.055972 -0.623694
O  -4.277517 1.126841 0.752057
O  -4.296041 0.223342 -1.586739
O  4.48193 0.509207 -0.634381
O  2.683451 -1.236731 -0.007663
N  -3.940592 -1.327842 0.352407
C  -1.997317 0.484057 -0.356949
C  -1.314765 0.090722 -1.502469
C  -1.325037 1.058223 0.714199
C  0.722241 0.841607 -0.49926
C  0.056683 0.262425 -1.568655
C  0.045567 1.242354 0.642364
C  -3.511635 -2.401798 -0.540268
C  -3.466818 -1.521963 1.720485
C  4.523575 0.235952 -2.046507
C  3.15693 -2.336514 0.780054
H  -1.833469 -0.345665 -2.345048
H  -1.852783 1.378049 1.601891
H  0.602575 -0.036542 -2.453491
H  0.572636 1.709944 1.462491
H  -3.928509 -2.278469 -1.535296
H  -3.896094 -3.336784 -0.137536
H  -2.423094 -2.486539 -0.610379
H  -3.867911 -0.765009 2.387648
H  -2.375216 -1.528709 1.794361
H  -3.834046 -2.487444 2.062267
H  4.003482 1.013929 -2.602724
H  4.092237 -0.736005 -2.283393
H  5.572826 0.234546 -2.327953
H  4.20748 -2.537933 0.573913
H  2.562232 -3.199672 0.494777
H  3.023672 -2.141989 1.843668
elementType: S P O N C H
totalener: -1959.51867082 hartree
nucrepener: 2024.12893570 hartree
electener: -3983.64760653 hartree
oneelecener: -6720.54862353 hartree
twoeener: 2736.90101700 hartree
cpcmener: -0.04279132 hartree
kineticenergy: 1953.64623689 hartree
xcener: -131.801655375615 hartree
chargesum: 0.0000000
charge: 0.882563 -0.433659 0.729608 -0.350999 -0.547561 -0.548518 -0.339959 -0.325066 -0.152557 -0.026415 -0.137072 -0.150769 0.251626 -0.171790 -0.136142 -0.214155 -0.213279 -0.113686 -0.108476 0.159067 0.156113 0.159036 0.158862 0.126266 0.124339 0.113008 0.125846 0.113080 0.124198 0.120930 0.123066 0.131157 0.129351 0.128850 0.113139
qa: 0.8826 -0.4337 0.7296 -0.3510 -0.5476 -0.5485 -0.3400 -0.3251 -0.1526 -0.0264 -0.1371 -0.1508 0.2516 -0.1718 -0.1361 -0.2142 -0.2133 -0.1137 -0.1085 0.1591 0.1561 0.1590 0.1589 0.1263 0.1243 0.1130 0.1258 0.1131 0.1242 0.1209 0.1231 0.1312 0.1294 0.1288 0.1131
va: 5.8324 2.0230 5.5079 2.0897 1.9432 1.9419 2.1083 2.0603 2.9442 3.6779 3.9496 4.0289 3.7525 4.0253 4.0253 3.9215 3.9238 3.8409 3.8270 1.0021 1.0081 0.9953 1.0043 1.0069 0.9944 0.9877 1.0071 0.9877 0.9940 0.9915 0.9910 0.9897 0.9845 0.9905 1.0041
dispcorr: -0.018183054 hartree
energy: -1959.536853877332
dipole: -2.59922 4.89706 2.29784 -16.95265 13.57224 -3.38041 -2.39421 1.38165 -1.01256
magnitude: 4.21100 au
magnitude: 10.70352 debye
