program: Orca
programVersion: 5.0.2
elementType: S S P O O O O O N C C C C C C C C C C H H H H H H H H H H H H H H H H
charge: 0
multiplicity: 1
keywords: wb97x-d3
keywords: def2-TZVPP
keywords: def2/J RIJCOSX
keywords: DEFGRID2
keywords: scfconv7
keywords: smallprint printgap noloewdin
keywords: NOSOSCF
formula: C10H16NO5PS2
InChI: InChI=1/C10H16NO5PS2/c1-11(2)19(12,13)10-7-5-9(6-8-10)16-17(18,14-3)15-4/h5-8H,1-4H3
35 atoms
S  -3.767819 0.183598 0.540834
S  3.426894 0.287727 1.850731
P  3.258898 0.031874 -0.039519
O  1.960774 0.703231 -0.746834
O  -3.900967 -0.481881 1.827597
O  -4.399174 1.479925 0.350208
O  4.41134 0.619775 -0.957269
O  3.116856 -1.455875 -0.580339
N  -4.398364 -0.839219 -0.602557
C  -2.040566 0.351615 0.195077
C  -1.591031 1.357385 -0.653139
C  -1.14669 -0.551476 0.753463
C  0.651514 0.545204 -0.384421
C  -0.241656 1.455721 -0.937304
C  0.203726 -0.460708 0.463286
C  -4.395015 -0.318806 -1.966655
C  -3.923776 -2.218039 -0.526698
C  5.049278 1.876425 -0.699102
C  3.975675 -2.505949 -0.117465
H  -2.274731 2.073581 -1.088057
H  -1.481674 -1.33191 1.422472
H  0.120614 2.239374 -1.589407
H  0.873913 -1.181695 0.908477
H  -5.009227 -0.981519 -2.572822
H  -3.394279 -0.286686 -2.407787
H  -4.840355 0.670594 -2.010846
H  -2.884818 -2.330207 -0.850684
H  -4.548371 -2.817443 -1.185673
H  -4.033236 -2.616054 0.477755
H  5.253741 2.007739 0.36331
H  4.427363 2.696565 -1.055245
H  5.988287 1.868637 -1.245586
H  4.052049 -2.504356 0.969909
H  4.969114 -2.406945 -0.553389
H  3.528456 -3.440708 -0.443281
elementType: S P O N C H
totalener: -1959.51922327 hartree
nucrepener: 2002.45973908 hartree
electener: -3961.97896235 hartree
oneelecener: -6677.71391624 hartree
twoeener: 2715.73495389 hartree
cpcmener: -0.03997336 hartree
kineticenergy: 1953.65088622 hartree
xcener: -131.806060845669 hartree
chargesum: -0.0000000
charge: 0.884199 -0.439761 0.753147 -0.309267 -0.549873 -0.549395 -0.342072 -0.336340 -0.154959 -0.041897 -0.122701 -0.168937 0.285987 -0.188527 -0.138803 -0.212246 -0.213815 -0.106474 -0.106405 0.157218 0.157185 0.154399 0.130498 0.123339 0.113121 0.125741 0.114028 0.123700 0.125693 0.105539 0.129069 0.129933 0.107087 0.131239 0.130350
qa: 0.8842 -0.4398 0.7531 -0.3093 -0.5499 -0.5494 -0.3421 -0.3363 -0.1550 -0.0419 -0.1227 -0.1689 0.2860 -0.1885 -0.1388 -0.2122 -0.2138 -0.1065 -0.1064 0.1572 0.1572 0.1544 0.1305 0.1233 0.1131 0.1257 0.1140 0.1237 0.1257 0.1055 0.1291 0.1299 0.1071 0.1312 0.1303
va: 5.8336 1.9963 5.5029 2.1784 1.9399 1.9422 2.1200 2.0889 2.9445 3.6997 3.9673 4.0508 3.7827 3.9994 3.9373 3.9218 3.9214 3.8313 3.8247 1.0043 1.0072 1.0025 1.0262 0.9942 0.9879 1.0071 0.9872 0.9945 1.0070 1.0042 0.9868 0.9886 1.0041 0.9900 0.9888
dispcorr: -0.017408013 hartree
energy: -1959.536631284397
dipole: -2.49628 5.06136 2.56509 -8.03960 6.54269 -1.49691 -10.56883 7.57952 -2.98931
magnitude: 4.21383 au
magnitude: 10.71071 debye
