program: Orca
programVersion: 5.0.2
elementType: S S P O O O O O N C C C C C C C C C C H H H H H H H H H H H H H H H H
charge: 0
multiplicity: 1
keywords: wb97x-d3
keywords: def2-TZVPP
keywords: def2/J RIJCOSX
keywords: DEFGRID2
keywords: scfconv7
keywords: smallprint printgap noloewdin
keywords: NOSOSCF
formula: C10H16NO5PS2
InChI: InChI=1/C10H16NO5PS2/c1-11(2)19(12,13)10-7-5-9(6-8-10)16-17(18,14-3)15-4/h5-8H,1-4H3
35 atoms
S  -3.831102 -0.14373 -0.243946
S  3.413405 1.861735 -1.479109
P  3.223795 0.35451 -0.319077
O  2.012785 -0.675309 -0.626319
O  -4.240828 1.222256 -0.532736
O  -4.449618 -1.237377 -0.978909
O  4.461858 -0.631931 -0.402577
O  2.932213 0.645922 1.2215
N  -4.129756 -0.415015 1.365485
C  -2.079348 -0.252802 -0.446899
C  -1.291422 0.866813 -0.215322
C  -1.496824 -1.477039 -0.754763
C  0.666901 -0.461849 -0.562459
C  0.089064 0.767874 -0.273206
C  -0.120896 -1.578218 -0.81627
C  -3.83425 -1.769741 1.824925
C  -3.600308 0.599793 2.272319
C  4.518154 -1.871561 0.326345
C  3.659334 1.656399 1.933289
H  -1.733503 1.828018 0.00848
H  -2.098798 -2.353379 -0.950644
H  0.68038 1.655539 -0.096851
H  0.345434 -2.52458 -1.0558
H  -4.263271 -1.882073 2.818483
H  -2.760387 -1.967896 1.895451
H  -4.296255 -2.513605 1.182971
H  -4.061109 0.445738 3.245994
H  -3.860927 1.600683 1.941307
H  -2.515399 0.530736 2.396173
H  3.940436 -2.638637 -0.18648
H  4.155737 -1.759704 1.347399
H  5.563454 -2.166282 0.352601
H  3.590443 2.618365 1.426246
H  4.706433 1.375845 2.043559
H  3.202231 1.733437 2.915646
elementType: S P O N C H
totalener: -1959.51902134 hartree
nucrepener: 2010.73886817 hartree
electener: -3970.25788951 hartree
oneelecener: -6693.75998845 hartree
twoeener: 2723.50209894 hartree
cpcmener: -0.04376469 hartree
kineticenergy: 1953.64848296 hartree
xcener: -131.804891175295 hartree
chargesum: -0.0000000
charge: 0.882019 -0.426641 0.715697 -0.303719 -0.548558 -0.550089 -0.341064 -0.329158 -0.151225 -0.034945 -0.176958 -0.130471 0.299515 -0.145246 -0.187522 -0.215559 -0.219124 -0.112177 -0.107457 0.159897 0.158408 0.130133 0.155902 0.124502 0.113000 0.126325 0.125976 0.127075 0.112441 0.122242 0.123633 0.129145 0.111942 0.131332 0.130727
qa: 0.8820 -0.4266 0.7157 -0.3037 -0.5486 -0.5501 -0.3411 -0.3292 -0.1512 -0.0349 -0.1770 -0.1305 0.2995 -0.1452 -0.1875 -0.2156 -0.2191 -0.1122 -0.1075 0.1599 0.1584 0.1301 0.1559 0.1245 0.1130 0.1263 0.1260 0.1271 0.1124 0.1222 0.1236 0.1291 0.1119 0.1313 0.1307
va: 5.8331 2.0211 5.5244 2.1652 1.9415 1.9413 2.1163 2.0493 2.9413 3.6902 4.0598 3.9637 3.7764 3.9608 3.9910 3.9231 3.9243 3.8383 3.8209 1.0039 1.0052 1.0308 1.0004 0.9935 0.9881 1.0074 0.9945 1.0060 0.9872 0.9911 0.9916 0.9900 1.0052 0.9866 0.9902
dispcorr: -0.018010864 hartree
energy: -1959.537032206828
dipole: -2.26870 4.86815 2.59945 -6.07128 4.40164 -1.66964 18.77038 -14.75450 4.01588
magnitude: 5.06677 au
magnitude: 12.87870 debye
