program: Orca
programVersion: 5.0.2
elementType: S S P O O O O O N C C C C C C C C C C H H H H H H H H H H H H H H H H
charge: 0
multiplicity: 1
keywords: wb97x-d3
keywords: def2-TZVPP
keywords: def2/J RIJCOSX
keywords: DEFGRID2
keywords: scfconv7
keywords: smallprint printgap noloewdin
keywords: NOSOSCF
formula: C10H16NO5PS2
InChI: InChI=1/C10H16NO5PS2/c1-11(2)19(12,13)10-7-5-9(6-8-10)16-17(18,14-3)15-4/h5-8H,1-4H3
35 atoms
S  -3.823462 -0.034083 -0.468925
S  2.704809 -0.438685 1.829998
P  3.155855 -0.079225 0.004863
O  2.010097 0.655901 -0.875425
O  -4.467622 1.125001 -1.068049
O  -4.186858 -1.360224 -0.944993
O  4.394581 0.876836 -0.275579
O  3.489157 -1.316016 -0.93796
N  -4.146373 0.007752 1.158938
C  -2.072365 0.155104 -0.631843
C  -1.521807 1.430733 -0.68034
C  -1.260785 -0.971955 -0.653311
C  0.660377 0.448379 -0.761424
C  -0.147291 1.576319 -0.737286
C  0.114127 -0.826833 -0.722355
C  -3.6009 -1.113105 1.920892
C  -3.886739 1.289305 1.809965
C  4.609529 2.066922 0.494468
C  4.492141 -2.270213 -0.559453
H  -2.145308 2.31417 -0.674933
H  -1.681275 -1.967497 -0.62844
H  0.295426 2.562675 -0.77392
H  0.737386 -1.70935 -0.768374
H  -2.516577 -1.046527 2.051881
H  -3.84985 -2.063725 1.459031
H  -4.061135 -1.0977 2.906832
H  -4.34284 2.109612 1.264125
H  -2.818941 1.488716 1.940682
H  -4.345733 1.256821 2.796195
H  4.685643 1.836839 1.556682
H  3.807431 2.786642 0.332887
H  5.547731 2.492487 0.150259
H  4.293791 -2.676649 0.432118
H  5.482903 -1.817496 -0.577073
H  4.449616 -3.07194 -1.291072
elementType: S P O N C H
totalener: -1959.52025690 hartree
nucrepener: 2013.76937669 hartree
electener: -3973.28963359 hartree
oneelecener: -6700.28408729 hartree
twoeener: 2726.99445370 hartree
cpcmener: -0.03951904 hartree
kineticenergy: 1953.64719160 hartree
xcener: -131.802704936874 hartree
chargesum: 0.0000000
charge: 0.881008 -0.440942 0.757745 -0.325098 -0.548732 -0.548275 -0.342560 -0.339778 -0.150794 -0.021621 -0.142809 -0.148562 0.225877 -0.155228 -0.135177 -0.214393 -0.216387 -0.113910 -0.110819 0.158851 0.156801 0.156876 0.152367 0.111417 0.126391 0.124904 0.126334 0.112536 0.124988 0.110789 0.128756 0.131250 0.108414 0.129027 0.130755
qa: 0.8810 -0.4409 0.7577 -0.3251 -0.5487 -0.5483 -0.3426 -0.3398 -0.1508 -0.0216 -0.1428 -0.1486 0.2259 -0.1552 -0.1352 -0.2144 -0.2164 -0.1139 -0.1108 0.1589 0.1568 0.1569 0.1524 0.1114 0.1264 0.1249 0.1263 0.1125 0.1250 0.1108 0.1288 0.1312 0.1084 0.1290 0.1308
va: 5.8333 1.9937 5.4857 2.1319 1.9418 1.9424 2.1052 2.1009 2.9397 3.6682 3.9688 4.0064 3.7990 3.9977 3.9529 3.9242 3.9231 3.8376 3.8336 1.0018 1.0079 0.9981 1.0112 0.9885 1.0071 0.9939 1.0068 0.9878 0.9944 1.0006 0.9849 0.9904 1.0008 0.9901 0.9893
dispcorr: -0.017789949 hartree
energy: -1959.538046851065
dipole: 0.70981 2.50262 3.21243 1.17567 -0.58979 0.58588 9.51938 -7.87398 1.64540
magnitude: 3.65654 au
magnitude: 9.29419 debye
