program: Orca
programVersion: 5.0.2
elementType: S S P O O O O O N C C C C C C C C C C H H H H H H H H H H H H H H H H
charge: 0
multiplicity: 1
keywords: wb97x-d3
keywords: def2-TZVPP
keywords: def2/J RIJCOSX
keywords: DEFGRID2
keywords: scfconv7
keywords: smallprint printgap noloewdin
keywords: NOSOSCF
formula: C10H16NO5PS2
InChI: InChI=1/C10H16NO5PS2/c1-11(2)19(12,13)10-7-5-9(6-8-10)16-17(18,14-3)15-4/h5-8H,1-4H3
35 atoms
S  -3.717122 0.301316 -0.619344
S  4.877823 0.711185 1.062938
P  3.323078 -0.026656 0.232418
O  1.970996 0.539155 0.914954
O  -4.29622 1.6027 -0.329367
O  -3.825379 -0.248995 -1.960508
O  3.157852 0.21317 -1.33415
O  3.081492 -1.593112 0.348065
N  -4.423059 -0.787461 0.408101
C  -2.000843 0.367543 -0.195179
C  -1.109769 -0.506933 -0.799922
C  -1.558337 1.270546 0.764726
C  0.673478 0.424108 0.497943
C  0.231441 -0.486989 -0.453657
C  -0.220437 1.297012 1.108573
C  -4.048759 -2.183309 0.219009
C  -4.491514 -0.394461 1.809769
C  3.465794 1.465794 -1.953327
C  4.097458 -2.531603 -0.027795
H  -1.43905 -1.208781 -1.554041
H  -2.237965 1.96547 1.239143
H  0.893153 -1.188392 -0.939041
H  0.135289 2.002862 1.847702
H  -3.045936 -2.40944 0.596002
H  -4.112328 -2.46915 -0.827072
H  -4.761548 -2.795583 0.769239
H  -3.526214 -0.471553 2.320743
H  -5.191186 -1.063378 2.308568
H  -4.874192 0.616599 1.916531
H  2.704051 2.211074 -1.723553
H  3.482062 1.287873 -3.025486
H  4.441259 1.834245 -1.635639
H  4.231598 -2.547169 -1.109264
H  3.757819 -3.508343 0.306576
H  5.046595 -2.297871 0.455368
elementType: S P O N C H
totalener: -1959.52178815 hartree
nucrepener: 2003.04531514 hartree
electener: -3962.56710329 hartree
oneelecener: -6678.39983561 hartree
twoeener: 2715.83273232 hartree
cpcmener: -0.03319283 hartree
kineticenergy: 1953.64565216 hartree
xcener: -131.804626661782 hartree
chargesum: 0.0000000
charge: 0.871677 -0.415945 0.693470 -0.302788 -0.533012 -0.533389 -0.321833 -0.324576 -0.155191 -0.041066 -0.172398 -0.125421 0.262330 -0.124007 -0.186981 -0.211783 -0.211258 -0.102048 -0.109227 0.154156 0.155645 0.138459 0.150278 0.109574 0.126556 0.121217 0.109067 0.121152 0.126516 0.126412 0.128208 0.110479 0.125874 0.128460 0.111394
qa: 0.8717 -0.4159 0.6935 -0.3028 -0.5330 -0.5334 -0.3218 -0.3246 -0.1552 -0.0411 -0.1724 -0.1254 0.2623 -0.1240 -0.1870 -0.2118 -0.2113 -0.1020 -0.1092 0.1542 0.1556 0.1385 0.1503 0.1096 0.1266 0.1212 0.1091 0.1212 0.1265 0.1264 0.1282 0.1105 0.1259 0.1285 0.1114
va: 5.8654 2.0534 5.5307 2.1734 1.9619 1.9609 2.0636 2.0920 2.9521 3.7121 4.0462 3.9692 3.8168 3.9039 4.0087 3.9233 3.9244 3.8280 3.8322 1.0096 1.0053 1.0241 1.0053 0.9874 1.0071 0.9946 0.9876 0.9946 1.0066 0.9847 0.9898 1.0071 0.9891 0.9891 1.0033
dispcorr: -0.017721345 hartree
energy: -1959.539509490806
dipole: -7.91724 8.97924 1.06200 -9.56796 7.60665 -1.96131 0.54857 -0.02097 0.52760
magnitude: 2.29193 au
magnitude: 5.82562 debye
