program: Orca
programVersion: 5.0.2
elementType: S S P O O O O O N C C C C C C C C C C H H H H H H H H H H H H H H H H
charge: 0
multiplicity: 1
keywords: wb97x-d3
keywords: def2-TZVPP
keywords: def2/J RIJCOSX
keywords: DEFGRID2
keywords: scfconv7
keywords: smallprint printgap noloewdin
keywords: NOSOSCF
formula: C10H16NO5PS2
InChI: InChI=1/C10H16NO5PS2/c1-11(2)19(12,13)10-7-5-9(6-8-10)16-17(18,14-3)15-4/h5-8H,1-4H3
35 atoms
S  -3.66184 0.172241 -0.401299
S  3.03669 -0.105322 2.128591
P  3.227179 0.122487 0.240424
O  2.150977 1.077942 -0.506043
O  -4.303554 1.47329 -0.287364
O  -4.017711 -0.676863 -1.533242
O  4.584754 0.8354 -0.166186
O  3.085234 -1.191347 -0.656019
N  -3.878783 -0.608061 1.044876
C  -1.907275 0.401638 -0.42057
C  -1.147645 -0.163202 -1.432336
C  -1.326672 1.197968 0.559407
C  0.801066 0.831281 -0.466462
C  0.221461 0.053042 -1.454679
C  0.039869 1.405986 0.542941
C  -3.395143 -1.981693 1.063247
C  -5.181481 -0.426341 1.677448
C  4.91249 1.16876 -1.523889
C  3.660627 -2.43642 -0.245192
H  -1.602913 -0.772909 -2.200438
H  -1.922487 1.64192 1.346293
H  0.824862 -0.373483 -2.244415
H  0.50876 2.022507 1.297781
H  -2.389863 -2.050284 0.647643
H  -4.049774 -2.670534 0.522806
H  -3.336168 -2.301822 2.102366
H  -5.420993 0.628771 1.779791
H  -5.117145 -0.847205 2.679668
H  -5.993525 -0.930452 1.14572
H  5.980711 1.369896 -1.542151
H  4.37529 2.062447 -1.839884
H  4.695362 0.349479 -2.209428
H  4.744179 -2.359227 -0.148854
H  3.423897 -3.158137 -1.023029
H  3.234554 -2.771978 0.700244
elementType: S P O N C H
totalener: -1959.51924270 hartree
nucrepener: 2009.94566873 hartree
electener: -3969.46491143 hartree
oneelecener: -6692.88316555 hartree
twoeener: 2723.41825412 hartree
cpcmener: -0.03307052 hartree
kineticenergy: 1953.65223933 hartree
xcener: -131.799191807193 hartree
chargesum: -0.0000000
charge: 0.873573 -0.423871 0.725163 -0.348105 -0.542086 -0.531828 -0.330840 -0.328649 -0.200726 -0.021058 -0.088743 -0.150870 0.265639 -0.156546 -0.172347 -0.193494 -0.195723 -0.112345 -0.112448 0.156108 0.143920 0.153921 0.152530 0.123623 0.115238 0.115382 0.119232 0.109167 0.118155 0.127807 0.120523 0.119985 0.127646 0.126553 0.115516
qa: 0.8736 -0.4239 0.7252 -0.3481 -0.5421 -0.5318 -0.3308 -0.3286 -0.2007 -0.0211 -0.0887 -0.1509 0.2656 -0.1565 -0.1723 -0.1935 -0.1957 -0.1123 -0.1124 0.1561 0.1439 0.1539 0.1525 0.1236 0.1152 0.1154 0.1192 0.1092 0.1182 0.1278 0.1205 0.1200 0.1276 0.1266 0.1155
va: 5.7872 2.0377 5.5247 2.0942 1.9442 1.9499 2.1113 2.0652 2.9399 3.6857 3.9171 4.0589 3.7423 4.0231 4.0237 3.9232 3.9084 3.8466 3.8382 1.0134 1.0119 1.0047 1.0050 0.9940 1.0010 0.9946 1.0094 0.9915 0.9923 0.9896 0.9904 0.9922 0.9851 0.9912 1.0015
dispcorr: -0.017514956 hartree
energy: -1959.536757660056
dipole: -5.11405 7.03244 1.91839 -10.15034 8.48476 -1.66558 0.31186 -0.62538 -0.31351
magnitude: 2.55982 au
magnitude: 6.50654 debye
