program: Orca
programVersion: 5.0.2
elementType: S S P O O O O O N C C C C C C C C C C H H H H H H H H H H H H H H H H
charge: 0
multiplicity: 1
keywords: wb97x-d3
keywords: def2-TZVPP
keywords: def2/J RIJCOSX
keywords: DEFGRID2
keywords: scfconv7
keywords: smallprint printgap noloewdin
keywords: NOSOSCF
formula: C10H16NO5PS2
InChI: InChI=1/C10H16NO5PS2/c1-11(2)19(12,13)10-7-5-9(6-8-10)16-17(18,14-3)15-4/h5-8H,1-4H3
35 atoms
S  -3.790096 -0.078872 -0.474049
S  4.837329 -1.007753 0.892067
P  3.320988 -0.269048 -0.006185
O  1.953345 -0.926965 0.544829
O  -3.959996 0.520123 -1.787756
O  -4.477139 -1.31973 -0.156127
O  3.124104 1.310498 0.08625
O  3.17451 -0.52643 -1.567417
N  -4.283282 1.044871 0.635322
C  -2.057974 -0.332115 -0.215194
C  -1.628691 -1.281422 0.705202
C  -1.137042 0.440822 -0.907539
C  0.646803 -0.670429 0.238102
C  -0.276066 -1.447269 0.930501
C  0.221343 0.276275 -0.685702
C  -4.283763 0.613425 2.026863
C  -3.768797 2.395091 0.445639
C  3.361507 2.026654 1.303317
C  4.244244 -0.207233 -2.46722
H  -2.331815 -1.905651 1.239688
H  -1.457083 1.172066 -1.637254
H  0.06938 -2.187348 1.640322
H  0.908837 0.890689 -1.247786
H  -3.279139 0.561442 2.459096
H  -4.77209 -0.35047 2.138917
H  -4.859102 1.339361 2.599405
H  -3.896113 2.722978 -0.582206
H  -2.715759 2.495025 0.728295
H  -4.351789 3.064181 1.076549
H  2.672117 1.713917 2.087456
H  3.195629 3.07718 1.080972
H  4.386734 1.887654 1.644666
H  4.391527 0.870626 -2.532973
H  3.955639 -0.590789 -3.441996
H  5.174063 -0.683744 -2.155282
elementType: S P O N C H
totalener: -1959.52177828 hartree
nucrepener: 2001.69992406 hartree
electener: -3961.22170234 hartree
oneelecener: -6675.64895986 hartree
twoeener: 2714.42725752 hartree
cpcmener: -0.03405925 hartree
kineticenergy: 1953.64557353 hartree
xcener: -131.804562076359 hartree
chargesum: 0.0000000
charge: 0.870716 -0.416606 0.689203 -0.295327 -0.533827 -0.532884 -0.321459 -0.324447 -0.154032 -0.042487 -0.127864 -0.169316 0.274755 -0.190397 -0.127894 -0.212306 -0.211130 -0.110171 -0.110277 0.155726 0.153351 0.150134 0.135514 0.109131 0.127121 0.120686 0.126699 0.109447 0.120479 0.127398 0.128726 0.115409 0.125558 0.129149 0.111220
qa: 0.8707 -0.4166 0.6892 -0.2953 -0.5338 -0.5329 -0.3215 -0.3244 -0.1540 -0.0425 -0.1279 -0.1693 0.2748 -0.1904 -0.1279 -0.2123 -0.2111 -0.1102 -0.1103 0.1557 0.1534 0.1501 0.1355 0.1091 0.1271 0.1207 0.1267 0.1094 0.1205 0.1274 0.1287 0.1154 0.1256 0.1291 0.1112
va: 5.8665 2.0523 5.5339 2.1841 1.9605 1.9619 2.0567 2.0915 2.9529 3.7134 3.9713 4.0464 3.8142 4.0075 3.9155 3.9239 3.9241 3.8319 3.8355 1.0045 1.0108 1.0056 1.0257 0.9876 1.0067 0.9947 1.0067 0.9875 0.9945 0.9849 0.9907 1.0040 0.9888 0.9894 1.0020
dispcorr: -0.017656050 hartree
energy: -1959.539434330922
dipole: -6.37691 7.77179 1.39488 13.80247 -11.17233 2.63014 4.83830 -3.61047 1.22782
magnitude: 3.22039 au
magnitude: 8.18557 debye
