program: Orca
programVersion: 5.0.2
elementType: S S P O O O O O N C C C C C C C C C C H H H H H H H H H H H H H H H H
charge: 0
multiplicity: 1
keywords: wb97x-d3
keywords: def2-TZVPP
keywords: def2/J RIJCOSX
keywords: DEFGRID2
keywords: scfconv7
keywords: smallprint printgap noloewdin
keywords: NOSOSCF
formula: C10H16NO5PS2
InChI: InChI=1/C10H16NO5PS2/c1-11(2)19(12,13)10-7-5-9(6-8-10)16-17(18,14-3)15-4/h5-8H,1-4H3
35 atoms
S  -3.701234 -0.108733 -0.425094
S  2.760153 0.043453 1.847332
P  3.193118 -0.025575 -0.011048
O  2.112494 0.626791 -1.024539
O  -4.352231 1.070517 -0.956525
O  -4.038544 -1.425467 -0.936553
O  4.524474 0.715505 -0.478297
O  3.377055 -1.460682 -0.679562
N  -3.873412 -0.037929 1.236256
C  -1.943079 0.084442 -0.569299
C  -1.34071 1.223651 -0.052195
C  -1.20248 -0.873607 -1.240905
C  0.765309 0.429766 -0.85877
C  0.023905 1.391111 -0.18611
C  0.165108 -0.700026 -1.387585
C  -3.374862 -1.204066 1.944179
C  -5.157566 0.449594 1.716201
C  4.882054 1.988743 0.04628
C  4.128825 -2.478045 -0.026213
H  -1.929244 1.965729 0.469695
H  -1.685857 -1.752452 -1.644248
H  0.516323 2.26146 0.224716
H  0.759934 -1.433792 -1.913893
H  -2.37741 -1.468627 1.595266
H  -4.024625 -2.077741 1.842823
H  -3.289125 -0.950625 3.00007
H  -5.052439 0.673258 2.777316
H  -5.966926 -0.277591 1.597598
H  -5.431461 1.367626 1.204991
H  4.843311 1.992225 1.136379
H  4.224858 2.769598 -0.339298
H  5.899262 2.188485 -0.281154
H  5.194875 -2.248792 -0.047681
H  3.952363 -3.399921 -0.574625
H  3.807376 -2.603391 1.008571
totalener: -1959.49786621 hartree
nucrepener: 2010.94971946 hartree
electener: -3970.44758567 hartree
oneelecener: -6694.49470826 hartree
twoeener: 2724.04712259 hartree
kineticenergy: 1953.72679847 hartree
xcener: -131.809625832937 hartree
chargesum: -0.0000000
charge: 0.842778 -0.386523 0.717381 -0.334516 -0.472900 -0.466750 -0.310973 -0.316963 -0.210963 -0.053780 -0.127403 -0.094706 0.217208 -0.114180 -0.114613 -0.195736 -0.201233 -0.123000 -0.122497 0.120171 0.148462 0.121226 0.137262 0.113674 0.116987 0.098639 0.091284 0.110109 0.125792 0.110971 0.113844 0.118715 0.115678 0.114983 0.111568
qa: 0.8428 -0.3865 0.7174 -0.3345 -0.4729 -0.4667 -0.3110 -0.3170 -0.2110 -0.0538 -0.1274 -0.0947 0.2172 -0.1142 -0.1146 -0.1957 -0.2012 -0.1230 -0.1225 0.1202 0.1485 0.1212 0.1373 0.1137 0.1170 0.0986 0.0913 0.1101 0.1258 0.1110 0.1138 0.1187 0.1157 0.1150 0.1116
va: 5.8243 2.0519 5.5290 2.1238 2.0204 2.0189 2.1223 2.1313 2.9366 3.8053 4.0703 3.9393 3.8561 4.0078 4.0129 3.9447 3.9272 3.8652 3.8682 1.0221 1.0190 1.0100 1.0114 0.9996 1.0007 0.9953 0.9914 0.9932 1.0131 1.0043 0.9876 0.9912 0.9883 0.9908 1.0031
dispcorr: -0.017198233 hartree
energy: -1959.515064442654
dipole: -3.48682 5.18863 1.70181 -2.34575 2.25427 -0.09148 9.34461 -8.34258 1.00203
magnitude: 1.97702 au
magnitude: 5.02518 debye
