program: Orca
programVersion: 5.0.2
elementType: S S P O O O O O N C C C C C C C C C C H H H H H H H H H H H H H H H H
charge: 0
multiplicity: 1
keywords: wb97x-d3
keywords: def2-TZVPP
keywords: def2/J RIJCOSX
keywords: DEFGRID2
keywords: scfconv7
keywords: smallprint printgap noloewdin
keywords: NOSOSCF
formula: C10H16NO5PS2
InChI: InChI=1/C10H16NO5PS2/c1-11(2)19(12,13)10-7-5-9(6-8-10)16-17(18,14-3)15-4/h5-8H,1-4H3
35 atoms
S  -3.73817 0.351997 -0.538698
S  4.881485 0.757933 0.958552
P  3.322114 0.109351 0.082899
O  1.978202 0.390409 0.934622
O  -4.3075 1.583891 -0.037135
O  -3.862246 -0.039836 -1.926162
O  2.918559 0.719257 -1.330762
O  3.290802 -1.462274 -0.246107
N  -4.391668 -0.880342 0.368114
C  -2.009147 0.362078 -0.13154
C  -1.134649 -0.473204 -0.812069
C  -1.540559 1.192845 0.877662
C  0.675544 0.34244 0.52469
C  0.209455 -0.496337 -0.480094
C  -0.196875 1.183255 1.203023
C  -4.056861 -2.233991 -0.028599
C  -4.446786 -0.669628 1.802602
C  3.895268 0.932415 -2.34533
C  3.776677 -2.417019 0.69153
H  -1.491091 -1.09639 -1.620864
H  -2.213391 1.865909 1.390919
H  0.872447 -1.159745 -1.01518
H  0.186749 1.835725 1.975554
H  -4.145823 -2.348284 -1.104938
H  -4.772991 -2.911347 0.436019
H  -3.050715 -2.537526 0.285773
H  -3.474507 -0.800813 2.292909
H  -5.140126 -1.395415 2.226691
H  -4.828814 0.321857 2.028483
H  4.781453 1.422941 -1.940778
H  3.436373 1.574566 -3.09219
H  4.18506 -0.01052 -2.810146
H  3.11186 -2.497595 1.553054
H  4.777143 -2.155069 1.037089
H  3.809168 -3.374592 0.177609
totalener: -1959.49794935 hartree
nucrepener: 2002.97181703 hartree
electener: -3962.46976637 hartree
oneelecener: -6678.05460702 hartree
twoeener: 2715.58484064 hartree
kineticenergy: 1953.70205094 hartree
xcener: -131.812548983136 hartree
chargesum: 0.0000000
charge: 0.854652 -0.350071 0.661291 -0.288921 -0.469809 -0.468567 -0.300785 -0.316593 -0.147739 -0.068906 -0.161231 -0.116216 0.209901 -0.104795 -0.143741 -0.220663 -0.218552 -0.123285 -0.117705 0.142826 0.143573 0.120969 0.135770 0.132757 0.104232 0.090778 0.093704 0.102643 0.133297 0.112778 0.120585 0.113578 0.113375 0.116105 0.114766
qa: 0.8547 -0.3501 0.6613 -0.2889 -0.4698 -0.4686 -0.3008 -0.3166 -0.1477 -0.0689 -0.1612 -0.1162 0.2099 -0.1048 -0.1437 -0.2207 -0.2186 -0.1233 -0.1177 0.1428 0.1436 0.1210 0.1358 0.1328 0.1042 0.0908 0.0937 0.1026 0.1333 0.1128 0.1206 0.1136 0.1134 0.1161 0.1148
va: 5.8988 2.1148 5.5260 2.1696 2.0351 2.0356 2.1074 2.0568 2.9592 3.8417 4.0237 3.9695 3.9432 3.9045 3.9903 3.9486 3.9499 3.8622 3.8603 1.0139 1.0149 1.0309 1.0088 1.0070 0.9992 0.9876 0.9876 0.9983 1.0065 1.0047 0.9900 0.9880 0.9869 1.0085 0.9907
dispcorr: -0.017501349 hartree
energy: -1959.515450694463
dipole: -7.44832 8.35258 0.90425 -12.77958 10.93815 -1.84143 1.71645 -1.25295 0.46350
magnitude: 2.10318 au
magnitude: 5.34587 debye
