program: Orca
programVersion: 5.0.4
elementType: S S P O O C C C C C C C C H H H H H H H H H H H H H H H H H H H
charge: 0
multiplicity: 1
keywords: wb97x-d3
keywords: def2-TZVPP
keywords: def2/J RIJCOSX
keywords: DEFGRID2
keywords: scfconv7
keywords: smallprint printgap noloewdin
keywords: NOSOSCF
formula: C8H19O2PS2
InChI: InChI=1/C8H19O2PS2/c1-4-7-12-11(9,10-6-3)13-8-5-2/h4-8H2,1-3H3
32 atoms
S  1.477633 1.225447 0.596057
S  -1.622101 0.281215 1.024385
P  0.087497 -0.163458 -0.063146
O  0.574582 -1.530703 0.608178
O  -0.060598 -0.178113 -1.5458
C  2.62464 1.277232 -0.83245
C  -2.178782 1.788266 0.132832
C  3.463343 0.026858 -1.021232
C  -3.058389 1.509328 -1.070386
C  4.346862 -0.309474 0.166685
C  -4.360738 0.807972 -0.726477
C  -0.260537 -2.704256 0.7478
C  -0.905039 -3.165006 -0.53616
H  3.2593 2.138874 -0.616777
H  2.048464 1.517438 -1.724225
H  -1.298976 2.375805 -0.132662
H  -2.722853 2.358201 0.887245
H  2.821204 -0.82161 -1.267529
H  4.084222 0.199439 -1.904547
H  -3.27493 2.477809 -1.529812
H  -2.501788 0.93627 -1.81268
H  4.97749 -1.171289 -0.051445
H  3.758118 -0.55095 1.052281
H  5.00256 0.525474 0.41983
H  -4.187289 -0.184659 -0.308702
H  -4.980237 0.684243 -1.614682
H  -4.937541 1.379541 0.002687
H  -1.01273 -2.512146 1.51574
H  0.41169 -3.468231 1.133585
H  -1.397475 -4.11878 -0.345094
H  -1.666503 -2.473499 -0.895671
H  -0.169309 -3.321556 -1.324333
elementType: S P O C H
totalener: -1604.67928334 hartree
nucrepener: 1298.84892544 hartree
electener: -2903.52820878 hartree
oneelecener: -4792.31843048 hartree
twoeener: 1888.79022170 hartree
cpcmener: -0.02404534 hartree
kineticenergy: 1600.33105115 hartree
xcener: -101.623579793153 hartree
chargesum: -0.0000000
charge: -0.178099 -0.188307 0.741773 -0.359895 -0.651095 -0.103477 -0.093108 -0.104379 -0.106896 -0.258275 -0.254617 0.010816 -0.234814 0.128016 0.122045 0.118257 0.129568 0.061184 0.082967 0.079222 0.065012 0.094453 0.072839 0.085669 0.072558 0.093356 0.085559 0.102935 0.112147 0.100886 0.077960 0.095740
qa: -0.1781 -0.1883 0.7418 -0.3599 -0.6511 -0.1035 -0.0931 -0.1044 -0.1069 -0.2583 -0.2546 0.0108 -0.2348 0.1280 0.1220 0.1183 0.1296 0.0612 0.0830 0.0792 0.0650 0.0945 0.0728 0.0857 0.0726 0.0934 0.0856 0.1029 0.1121 0.1009 0.0780 0.0957
va: 2.2904 2.2858 5.3499 2.0808 1.9162 3.8803 3.8562 3.8767 3.9075 3.9322 3.9270 3.8878 3.8907 1.0028 1.0276 1.0272 1.0031 1.0279 1.0085 1.0088 1.0303 1.0050 1.0142 1.0008 1.0127 1.0050 1.0004 0.9880 0.9893 1.0095 1.0154 1.0067
dispcorr: -0.013835365 hartree
energy: -1604.693118706078
dipole: -1.78114 1.60471 -0.17643 -3.88484 3.95709 0.07226 -7.20656 7.66012 0.45356
magnitude: 0.49200 au
magnitude: 1.25057 debye
