program: Orca
programVersion: 5.0.4
elementType: S S P O O C C C C C C C C H H H H H H H H H H H H H H H H H H H
charge: 0
multiplicity: 1
keywords: wb97x-d3
keywords: def2-TZVPP
keywords: def2/J RIJCOSX
keywords: DEFGRID2
keywords: scfconv7
keywords: smallprint printgap noloewdin
keywords: NOSOSCF
formula: C8H19O2PS2
InChI: InChI=1/C8H19O2PS2/c1-4-7-12-11(9,10-6-3)13-8-5-2/h4-8H2,1-3H3
32 atoms
S  1.081819 0.293447 -1.137597
S  -1.640841 0.377092 0.852129
P  -0.42903 -0.855286 -0.289871
O  0.164345 -1.723474 0.911837
O  -1.103525 -1.591866 -1.393068
C  1.805157 1.188713 0.288898
C  -2.364751 1.378349 -0.502391
C  2.881355 0.427825 1.040656
C  -2.957007 2.655175 0.068849
C  4.084555 0.061543 0.19047
C  -3.624255 3.472181 -1.026969
C  0.616356 -3.085065 0.714067
C  1.87486 -3.182674 -0.111863
H  0.989929 1.493735 0.945959
H  2.215395 2.09873 -0.151499
H  -3.124957 0.781477 -1.004162
H  -1.579647 1.617192 -1.221332
H  3.200798 1.072973 1.863639
H  2.45649 -0.463275 1.503547
H  -3.686938 2.417016 0.845065
H  -2.167675 3.240124 0.543606
H  3.811537 -0.597058 -0.634826
H  4.837234 -0.455156 0.78598
H  4.552673 0.950604 -0.235074
H  -2.917004 3.726526 -1.816717
H  -4.024879 4.403599 -0.628119
H  -4.449523 2.924628 -1.482273
H  -0.191117 -3.669002 0.270787
H  0.786251 -3.462569 1.720382
H  2.686747 -2.594081 0.314611
H  2.193785 -4.225511 -0.129837
H  1.720176 -2.869567 -1.144147
elementType: S P O C H
totalener: -1604.68111473 hartree
nucrepener: 1288.00881759 hartree
electener: -2892.68993232 hartree
oneelecener: -4769.90315181 hartree
twoeener: 1877.21321949 hartree
cpcmener: -0.02632939 hartree
kineticenergy: 1600.33859912 hartree
xcener: -101.625228333091 hartree
chargesum: -0.0000000
charge: -0.177548 -0.171383 0.735049 -0.360092 -0.659534 -0.101793 -0.108324 -0.115302 -0.084616 -0.271304 -0.274857 0.040966 -0.268904 0.123825 0.126834 0.117159 0.110151 0.085877 0.068753 0.073381 0.072788 0.072113 0.097784 0.094848 0.084349 0.093685 0.084533 0.107529 0.111554 0.093405 0.109102 0.089973
qa: -0.1775 -0.1714 0.7350 -0.3601 -0.6595 -0.1018 -0.1083 -0.1153 -0.0846 -0.2713 -0.2749 0.0410 -0.2689 0.1238 0.1268 0.1172 0.1102 0.0859 0.0688 0.0734 0.0728 0.0721 0.0978 0.0948 0.0843 0.0937 0.0845 0.1075 0.1116 0.0934 0.1091 0.0900
va: 2.2820 2.3103 5.3808 2.0794 1.9411 3.8458 3.8924 3.8943 3.9010 3.9215 3.9547 3.8232 3.9160 1.0317 1.0052 1.0145 1.0188 1.0107 1.0195 1.0085 1.0122 1.0102 1.0026 1.0023 1.0002 1.0042 1.0011 1.0063 0.9907 0.9947 1.0124 1.0122
dispcorr: -0.014291505 hartree
energy: -1604.695406231904
dipole: 8.01369 -6.81875 1.19494 7.84689 -6.74555 1.10134 1.80740 -0.54270 1.26470
magnitude: 2.05920 au
magnitude: 5.23406 debye
