program: Orca
programVersion: 5.0.4
elementType: S S P O O C C C C C C C C H H H H H H H H H H H H H H H H H H H
charge: 0
multiplicity: 1
keywords: wb97x-d3
keywords: def2-TZVPP
keywords: def2/J RIJCOSX
keywords: DEFGRID2
keywords: scfconv7
keywords: smallprint printgap noloewdin
keywords: NOSOSCF
formula: C8H19O2PS2
InChI: InChI=1/C8H19O2PS2/c1-4-7-12-11(9,10-6-3)13-8-5-2/h4-8H2,1-3H3
32 atoms
S  2.128694 -0.735954 0.31121
S  -0.55203 0.975849 1.141101
P  0.104736 -0.543877 -0.100521
O  -0.523815 -1.837158 0.601002
O  -0.209745 -0.380933 -1.548118
C  2.843406 0.353007 -0.982294
C  -2.318658 1.044749 0.63523
C  2.60424 1.836101 -0.769996
C  -2.573024 1.975502 -0.534726
C  3.180443 2.375748 0.527085
C  -4.04688 1.981553 -0.912876
C  -0.572198 -3.097296 -0.114306
C  -1.910881 -3.285028 -0.780955
H  2.473023 0.016548 -1.949118
H  3.910026 0.124544 -0.946061
H  -2.847117 1.382721 1.527651
H  -2.666048 0.03046 0.430873
H  3.065319 2.349161 -1.618592
H  1.535726 2.056314 -0.83138
H  -2.248907 2.984557 -0.272722
H  -1.973849 1.664751 -1.39135
H  4.255555 2.193882 0.585921
H  2.717743 1.912753 1.400138
H  3.02149 3.451338 0.604668
H  -4.380704 0.98874 -1.219042
H  -4.232957 2.662674 -1.743573
H  -4.673201 2.299445 -0.077606
H  -0.397833 -3.862766 0.63998
H  0.243236 -3.16044 -0.838577
H  -2.079486 -2.547493 -1.565183
H  -1.947377 -4.274472 -1.237854
H  -2.725698 -3.22191 -0.059633
elementType: S P O C H
totalener: -1604.68186546 hartree
nucrepener: 1292.13535412 hartree
electener: -2896.81721959 hartree
oneelecener: -4778.76757330 hartree
twoeener: 1881.95035371 hartree
cpcmener: -0.02321489 hartree
kineticenergy: 1600.32063328 hartree
xcener: -101.617881388808 hartree
chargesum: 0.0000000
charge: -0.186079 -0.177127 0.737541 -0.371955 -0.649937 -0.097312 -0.071126 -0.111788 -0.092811 -0.254833 -0.271660 0.048878 -0.254842 0.125480 0.126795 0.131533 0.107027 0.085707 0.057472 0.065848 0.062074 0.090204 0.067646 0.096135 0.084463 0.093974 0.084282 0.108919 0.091755 0.082452 0.101739 0.089547
qa: -0.1861 -0.1771 0.7375 -0.3720 -0.6499 -0.0973 -0.0711 -0.1118 -0.0928 -0.2548 -0.2717 0.0489 -0.2548 0.1255 0.1268 0.1315 0.1070 0.0857 0.0575 0.0658 0.0621 0.0902 0.0676 0.0961 0.0845 0.0940 0.0843 0.1089 0.0918 0.0825 0.1017 0.0895
va: 2.2972 2.2812 5.3705 2.0698 1.9150 3.8608 3.8736 3.8893 3.8977 3.9292 3.9603 3.8558 3.9302 1.0265 1.0021 1.0027 1.0202 1.0101 1.0241 1.0130 1.0288 1.0018 1.0119 1.0045 1.0007 1.0036 1.0004 0.9929 1.0061 1.0180 1.0084 1.0028
dispcorr: -0.013914362 hartree
energy: -1604.695779825561
dipole: -8.51145 8.31914 -0.19231 7.01143 -7.17135 -0.15992 -6.91291 7.09139 0.17848
magnitude: 0.30727 au
magnitude: 0.78101 debye
