program: Orca
programVersion: 5.0.4
elementType: S S P O O C C C C C C C C H H H H H H H H H H H H H H H H H H H
charge: 0
multiplicity: 1
keywords: wb97x-d3
keywords: def2-TZVPP
keywords: def2/J RIJCOSX
keywords: DEFGRID2
keywords: scfconv7
keywords: smallprint printgap noloewdin
keywords: NOSOSCF
formula: C8H19O2PS2
InChI: InChI=1/C8H19O2PS2/c1-4-7-12-11(9,10-6-3)13-8-5-2/h4-8H2,1-3H3
32 atoms
S  0.808819 0.40865 -1.319125
S  -1.557086 0.422521 1.161961
P  -0.577419 -0.725714 -0.263444
O  0.223453 -1.654792 0.760239
O  -1.448278 -1.395578 -1.26623
C  1.793095 1.209882 -0.000571
C  -2.941018 1.075616 0.150036
C  3.020715 0.4164 0.407964
C  -2.557839 2.06723 -0.932565
C  3.838832 1.169749 1.445875
C  -1.800152 3.28197 -0.42845
C  0.997909 -2.781569 0.282806
C  0.205568 -4.058314 0.404929
H  1.140232 1.419727 0.849082
H  2.07924 2.175229 -0.42064
H  -3.584669 1.549383 0.893251
H  -3.490376 0.228435 -0.257505
H  2.723139 -0.55276 0.810012
H  3.633461 0.217124 -0.473316
H  -1.987241 1.566217 -1.716469
H  -3.494285 2.38483 -1.399007
H  4.716929 0.594142 1.739172
H  3.256086 1.365176 2.347369
H  4.186291 2.129134 1.059529
H  -0.819377 3.01303 -0.033885
H  -2.34966 3.790409 0.365684
H  -1.643256 3.999245 -1.233978
H  1.889238 -2.810622 0.907053
H  1.324808 -2.612384 -0.745854
H  -0.676192 -4.049676 -0.235312
H  0.831824 -4.897606 0.101963
H  -0.110556 -4.232719 1.433261
elementType: S P O C H
totalener: -1604.68211551 hartree
nucrepener: 1302.22612994 hartree
electener: -2906.90824545 hartree
oneelecener: -4798.45109519 hartree
twoeener: 1891.54284974 hartree
cpcmener: -0.02626857 hartree
kineticenergy: 1600.32656076 hartree
xcener: -101.621433950785 hartree
chargesum: 0.0000000
charge: -0.173851 -0.179689 0.731261 -0.359490 -0.656994 -0.094017 -0.102842 -0.083195 -0.116625 -0.275178 -0.257547 0.039973 -0.246102 0.107695 0.130127 0.129872 0.124749 0.068401 0.067517 0.064891 0.086695 0.093646 0.084456 0.087114 0.067827 0.091451 0.097098 0.108449 0.099028 0.079242 0.096627 0.089408
qa: -0.1739 -0.1797 0.7313 -0.3595 -0.6570 -0.0940 -0.1028 -0.0832 -0.1166 -0.2752 -0.2575 0.0400 -0.2461 0.1077 0.1301 0.1299 0.1247 0.0684 0.0675 0.0649 0.0867 0.0936 0.0845 0.0871 0.0678 0.0915 0.0971 0.1084 0.0990 0.0792 0.0966 0.0894
va: 2.2875 2.2834 5.3856 2.0777 1.9465 3.8415 3.8600 3.9160 3.8797 3.9654 3.9358 3.8401 3.9741 1.0249 1.0038 1.0015 1.0248 1.0132 1.0132 1.0230 1.0083 1.0039 0.9996 1.0008 1.0063 1.0022 1.0049 0.9850 1.0008 1.0182 1.0059 1.0034
dispcorr: -0.014767028 hartree
energy: -1604.696882540116
dipole: 9.28290 -7.96768 1.31522 6.27695 -5.35823 0.91871 4.06661 -3.07987 0.98674
magnitude: 1.88348 au
magnitude: 4.78742 debye
